{"text_format":"1","workbook":"xlsx","n_sheets":7,"sheets":["ReleaseNote","Formulaire à remplir","Languages","Liste des balises","Listes de données","Conversion","Feuil1"],"not_rendered":{"charts":0,"images":0,"macros":1,"external_links":0,"defined_names":18,"comments":0,"pivot_tables":0},"unopened":[],"bounds":{"document_bytes":16777216,"sheet_cells":100000,"rows_first":2000,"rows_last":500,"rows_between":2000,"halvings":0,"cell_chars":16384,"cell_head_chars":4096},"cells_cut":0,"cells_raw":0,"read":"whole","date_system":"1900"}

{"sheet":"ReleaseNote","index":0,"n_rows":14,"n_cols":5,"rows_kept":14,"cut":false,"hidden":false,"merged":[[12,0,13,0],[12,1,13,1],[12,4,13,4]]}
["Date","Version","Modifications","Impacts","Auteur"]
["2013-07-29","7.6","Passage en V7.6 - Modification titre fichier","N/A","J. ROUSSEAU (CANAL+)"]
[null,null,"Ajout d'une liste déroulante pour \"Diffuseur\"","Ajout de données dans \"Liste de données\", ajout d'une liste déroulante dans \"Formulaire\"\nUniquement CANAL+ dans la liste pour le moment","J. ROUSSEAU (CANAL+)"]
[null,null,"Ajout d'une fonction doTitle() de calcul de titre automatique","La fonction récupère les valeurs de ProgramTitle, PostHouseNumber et RevisionID.\nLa fonction ne garde dans chacune de ces chaînes uniquement les caractères ASCII dont code compris entre 48 et 57, 65 et 90, 97 et 122 ou égal à 95. (minuscules, majuscules, chiffre, underscore).\nOn tronque ensuite le résultat à 20 caractères pour le titre, 10 pour le labo et 2 pour revisionID.\nOn concatène les 3 chaines, séparées par des underscore et ajoute l'extension.","J. ROUSSEAU (CANAL+)"]
[null,null,"Changement libellé \"Fournisseur\" en \"Fournisseur du fichier\"","Changement uniquement dans le libellé affiché dans le fichier excel","J. ROUSSEAU (CANAL+)"]
[null,null,"Affichage de RevisionID dans \"Description fichier\"","Affichage de revisionID comme donnée obligatoire","J. ROUSSEAU (CANAL+)"]
[null,null,"Contrôle du la valeur de RevisionID","La valeur de révisionID doit être comprise entre 0 et 99. Si la donnée saisie est incorrecte, un message d'erreur bloquant et affiché.","J. ROUSSEAU (CANAL+)"]
[null,null,"Dolby : changement des valeurs possibles pour \"Type de mixage\"","Ajout de deux valeurs distinctes : 5.0 / 5.1","J. ROUSSEAU (CANAL+)"]
[null,null,"Valeur par défaut pour Dolby","Valeur par défaut : 5.1","J. ROUSSEAU (CANAL+)"]
[null,null,"Valeur par défaut pour Sous-titrage","Valeur par défaut : fichier joint","J. ROUSSEAU (CANAL+)"]
[null,null,"Valeur par défaut Titre du programme","Valeur par défaut : vide, contrôle effectué lors du clic, génération impossible si vide","J. ROUSSEAU (CANAL+)"]
["2015-10-15","MetaPAD-V1.0","Ajouter valeur 2,40 dans le format image","Ajout dans liste de données","ANR (CANAL+)"]
["2015-11-17","MetaPAD-V1.1","Autoriser valeurs décimales pour le Loudness","Modification contrôle validation des données","ANR (CANAL+)"]
[null,null,"Ajout des diffuseurs CHERIE25 et NRJHITS","Modification VB et listes de valeurs"]

{"sheet":"Formulaire à remplir","index":1,"n_rows":204,"n_cols":15,"rows_kept":204,"cut":false,"hidden":false,"merged":[[10,9,10,10],[15,9,15,10],[1,1,2,1]]}
[]
[null,"MetaPADTV"]
[]
[]
[null,"Général / General",null,"Type",null,null,"Donnée Obligatoire",null,null,null,null,"Obligatoire / Compulsory"]
[null,"Nom du MXF",null,"Général",null,"Balise XML correspondante",null,"Nature","A saisir",null,null,"OUI / YES"]
[null,"<?xml version=\"1.0\" encoding=\"iso-8859-1\" ?>"]
[null,"<p:PADexchange_V5.0 xmlns:xsi=\"http://www.w3.org/2001/XMLSchema-instance\" xmlns:p=\"http://com.canalplus.mit/padv5\" xsi:schemaLocation=\"http://com.canalplus.mit/padv5 asbo/PADexchange_V5.0.xsd\">"]
[null,"</p:PADexchange_V5.0>"]
[]
[null,"Description Fichier",null,null,null,null,null,null,null,"Tests diffuseur"]
[null,"Numéro d'Affaire/Programme/Version",{"$f":"IF(C14=\"CANAL+\",C17&\"_\"&C19&\"_\"&C20&\"_\"&C13,C18)","v":"M6AD12"},"Description",null,"BroadcasterPrivateID"]
[null,"Format",{"$f":"IF(C122=\"HD\",\"HD\",IF(C121=\"16/9\",\"16/\",IF(C121=\"4/3\",\"4/3\",)))","v":"HD"},null,null,null,null,null,null,null,4]
[null,"Diffuseur / Broadcaster",null,"Description",null,"BroadcasterName","x",null,"x",null,null,"OUI / YES"]
[null,"Fournisseur du fichier / File provider",null,"Description",null,"PostHouseName","x","CDATA","x","OldDiffuseur -->",null,"OUI / YES"]
[null,"Nature de programme / Program nature","Programme","Description",null,"ProgramNature","x",null,"x","tests Format",null,"OUI / YES"]
[null,"Numéro d'Affaire / Production Number",null,"Description","NumAff",null,"A",null,"x","HD","SD","OUI / YES"]
[null,"HouseID","M6AD12","Description","HouseID",null,"A",null,null,"OldFormat -->","HD","OUI / YES"]
[null,"Numéro de Programme / Program Number",null,"Description","NumPrg",null,"A",null,"x",null,null,"OUI / YES"]
[null,"Type de programme (Version audio) / Program Type (Audio Version)","VM","Description",null,"ProgramType","A",null,"x","XDCAM HD","IMX-D10","OUI / YES",null,"Types de programme : \nVF - Version Française : La langue de tournage n’est pas le français. La version française a été fabriquée.\nVM - Version multilingue : Concernent les programmes qui ne sont pas tournés en français\nPour fabriquer en VM, il faut avoir une version française et une version sous-titrée en télétexte. Ce mode de diffusion du sous-titrage permet de diffuser simultanément une version originale sous-titrée et une version française. Au téléspectateur de choisir sa langue de réception. \nVR - Version originale française : Concerne les programmes tournés en français\nVT - Version originale sous-titrée : Il s’agit des programmes dont la langue de tournage n’est pas le français et qui on reçu un sous-titrage en français.\nVO – Version Originale : Concerne les programmes non doublés, non sous-titrés dont la langue de tournage n’est pas le français.\nRE – Version Remontée\nRC – Version remontée Courte\nVI - Version Internationale\nAF - Version Audiodécrite Française\nAM - Version Audiodécrite Multilin.\nAR - Version Audiodécrite Orig. Fr.\nBO - Version Bonus Intégré\nRM - Version Remontée Multilingue","Program types: \nVF - French Version: the movie language is not French. The French version has been built.\nVM - Multilingual Version: the movie language is not French. To build a VM, both French version and teletext subtitled version must be present. This broadcast mode of subtitles allows broadcasting original subtitled version and French version together. Viewers can choose the language they want.\nVR - Original French Version: The movie language is French. \nVT - Orignial Subtitled Version: The movie language is not French, subtitled in French. \nVO - Original Version: The movie language is not French, without french subtitles. The movie language is not French. \nRE - Edited Version\nRC - Short Edited Version\nVI - International version\nAF - French version with audio description \nAM - Multilingual version audio description\nAR -  Original French Version with audio description\nBO - Version with bonus\nRM - Edited Version with multi lanquage "]
[null,"Titre Programme Local / Local Program Title",null,"Description",null,"ProgramTitle","x","CDATA","x",1920,720,"OUI / YES"]
[null,"Titre Episode Local / Local Episode Title",null,"Description",null,"ProgramSecondTitle",null,"CDATA","x",1080,576,"NON / NO"]
[null,"Titre Programme Original / Original Program Title",null,"Description",null,"VO_ProgramTitle",null,"CDATA","x","16/9","libre","NON / NO"]
[null,"Titre Episode Original / Original Episode Title",null,"Description",null,"VO_ProgramSecondTitle",null,"CDATA","x",null,null,"NON / NO"]
[null,"RevisionID / RevisionID",null,"Description",null,"Revision_ID","x",null,"x",null,null,"OUI / YES"]
[null,"Durée du programme","00:05:00:00","Description",null,"ProgramDuration",null,null,null,null,null,null,null,"Concerne les programmes tournés en français"]
[null,null,1,"Description",null,"ClientPartNum",null,null,null,null,null,null,null,"VT : Version originale sous-titrée"]
[null,null,1,"Description",null,"ClientPartTotal",null,null,null,null,null,null,null,"Il s’agit des programmes dont la langue de tournage n’est pas le français et qui on réçu un sous-titrage en français."]
[null,"Nom générateur XML","MetaPADTV","Description",null,"XmlGeneratorName"]
[null,"Release générateur XML","1.1","Description",null,"XmlGeneratorRelease"]
[null,"Release fichier","1.1","Description",null,"XmlFileRelease"]
[]
[null,"Informations techniques / Technical informations"]
[null,"TC in Fichier (amorce) / File TC in (amorce)","10:00:00:00","Infos Techniques",null,"TC_IN_Header","x","TC","x","Chaine","Contrôle ID","OUI / YES"]
[null,"TC out Fichier (postroll) / File TC out (postroll)","10:04:59:24","Infos Techniques",null,"TC_OUT_Footer","x","TC","x","CANAL+","AFFPRG_NUM","OUI / YES"]
[null,"TC in Programme / Program TC in","10:00:00:00","Infos Techniques",null,"TC_IN_PGM","x","TC","x","TF1","HOUSEID_ALPHA","OUI / YES"]
[null,"TC out Programme / TC out Program","10:04:59:24","Infos Techniques",null,"TC_OUT_PGM","x","TC","x","M6","HOUSEID_ALPHA","OUI / YES"]
[null,"Spécification fichier","NA","Infos Techniques",null,null,"x",null,"x","NRJ12","HOUSEID_ALPHA","OUI / YES"]
[null,null,{"$f":"IF(C38<>\"NA\",VLOOKUP(C38,Conversion!E2:F4,2,FALSE),\"\")","v":""},"Infos Techniques",null,"ApplicationSpecification",null,null,null,"CHERIE25","HOUSEID_ALPHA"]
[null,null,{"$f":"IF((C39=\"AS10\")*AND(C122=\"HD\"),\"HIGH_HD_2014\",IF(C122=\"SD\",\"\",\"\"))","v":""},"Infos Techniques",null,"Shim",null,null,null,"NRJHITS","HOUSEID_ALPHA"]
[null,"Fonction de hachage (HashType)","NA",null,null,"HashType",null,null,"x",null,null,"OUI / YES"]
[null,"Empreinte de hachage (HashCode)",null,"Infos Techniques",null,null,null,null,"x",null,null,"NON / NO"]
[null,"CALCULE Fonction de hachage (HashType)",{"$f":"IF(C41=\"NA\",\"\",C41)","v":""}]
[null,"CALCULE Empreinte de hachage (HashCode)",{"$f":"IF(C41=\"NA\",\"\",C42)","v":""},null,null,"HashValue"]
[null,"Remarque Video / Video remarks",null,"Infos Techniques",null,"Video_remarks",null,"CDATA","x",null,null,"NON / NO"]
[null,"Remarque Audio / Audio remarks",null,"Infos Techniques",null,"Audio_remarks",null,"CDATA","x",null,null,"NON / NO"]
[null,"Autres remarques / Other remarks",null,"Infos Techniques",null,"Other_remarks",null,"CDATA","x",null,null,"NON / NO"]
[]
[null,"Description de la segmentation / Segmentation description"]
[null,"Nombre de parties / Number of parts",1,"Segment",null,"Number_SEG","x",null,"x","OldNbPart -->",1,"OUI / YES"]
[]
[null,"Description de la partie 1 / \nPart 1 description","TimeCodes ci-dessous calculés automatiquement"]
[null,"Numéro de partie / Part number",1,"Segment1",null,"SEG_ID",null,null,"x",null,null,"OUI / YES"]
[null,"TC in (Programme ou message) / \nTC in (Program or message)","10:00:00:00","Segment1",null,"TC_IN_SEG",null,"TC","x",null,null,"OUI / YES"]
[null,"TC out (Programme ou message) / \nTC out (Program or message)","10:04:59:24","Segment1",null,"TC_OUT_SEG",null,"TC","x",null,null,"OUI / YES"]
[]
[null,"Description de la partie 2 / \nPart 2 Description"]
[null,"Numéro de partie / Part number",2,"Segment2",null,"SEG_ID",null,null,"x",null,null,"OUI / YES"]
[null,"TC in (Programme ou message) / \nTC in (Program or message)","00:01:00:00","Segment2",null,"TC_IN_SEG",null,"TC","x",null,null,"OUI / YES"]
[null,"TC out (Programme ou message) / \nTC out (Program or message)","00:30:00:00","Segment2",null,"TC_OUT_SEG",null,"TC","x",null,null,"OUI / YES"]
[]
[null,"Description de la partie 3 / \nPart 3 description"]
[null,"Numéro de partie / Part number",3,"Segment3",null,"SEG_ID",null,null,"x",null,null,"OUI / YES"]
[null,"TC in (Programme ou message) / \nTC in (Program or message)","10:32:00:00","Segment3",null,"TC_IN_SEG",null,"TC","x",null,null,"OUI / YES"]
[null,"TC out (Programme ou message) / \nTC out (Program or message)","11:00:00:00","Segment3",null,"TC_OUT_SEG",null,"TC","x",null,null,"OUI / YES"]
[]
[null,"Description de la partie 4 / \nPart 4 description",null,null,null,null,null,null,null,null,4]
[null,"Numéro de partie / Part number",4,"Segment4",null,"SEG_ID",null,null,"x",null,null,"OUI / YES"]
[null,"TC in (Programme ou message) / \nTC in (Program or message)","10:03:00:01","Segment4",null,"TC_IN_SEG",null,"TC","x",null,null,"OUI / YES"]
[null,"TC out (Programme ou message) / \nTC out (Program or message)","10:04:00:00","Segment4",null,"TC_OUT_SEG",null,"TC","x",null,null,"OUI / YES"]
[null,null,null,null,null,null,null,null,null,null,4]
[null,"Description de la partie 5 / \nPart 5 description",null,null,null,null,null,null,null,null,4]
[null,"Numéro de partie / Part number",5,"Segment5",null,"SEG_ID",null,null,"x",null,null,"OUI / YES"]
[null,"TC in (Programme ou message) / \nTC in (Program or message)","10:04:00:01","Segment5",null,"TC_IN_SEG",null,"TC","x",null,null,"OUI / YES"]
[null,"TC out (Programme ou message) / \nTC out (Program or message)","10:05:00:00","Segment5",null,"TC_OUT_SEG",null,"TC","x",null,null,"OUI / YES"]
[null,null,null,null,null,null,null,null,null,null,4]
[null,"Description de la partie 6 / \nPart 6 description",null,null,null,null,null,null,null,null,4]
[null,"Numéro de partie / Part number",6,"Segment6",null,"SEG_ID",null,null,"x",null,null,"OUI / YES"]
[null,"TC in (Programme ou message) / \nTC in (Program or message)","10:05:00:01","Segment6",null,"TC_IN_SEG",null,"TC","x",null,null,"OUI / YES"]
[null,"TC out (Programme ou message) / \nTC out (Program or message)","10:06:00:00","Segment6",null,"TC_OUT_SEG",null,"TC","x",null,null,"OUI / YES"]
[null,null,null,null,null,null,null,null,null,null,4]
[null,"Description de la partie 7 / \nPart 7 description",null,null,null,null,null,null,null,null,4]
[null,"Numéro de partie / Part number",7,"Segment7",null,"SEG_ID",null,null,"x",null,null,"OUI / YES"]
[null,"TC in (Programme ou message) / \nTC in (Program or message)","10:06:00:01","Segment7",null,"TC_IN_SEG",null,"TC","x",null,null,"OUI / YES"]
[null,"TC out (Programme ou message) / \nTC out (Program or message)","10:07:00:00","Segment7",null,"TC_OUT_SEG",null,"TC","x",null,null,"OUI / YES"]
[null,null,null,null,null,null,null,null,null,null,4]
[null,"Description de la partie 8 / \nPart 8 description",null,null,null,null,null,null,null,null,4]
[null,"Numéro de partie / Part number",8,"Segment8",null,"SEG_ID",null,null,"x",null,null,"OUI / YES"]
[null,"TC in (Programme ou message) / \nTC in (Program or message)","10:07:00:01","Segment8",null,"TC_IN_SEG",null,"TC","x",null,null,"OUI / YES"]
[null,"TC out (Programme ou message) / \nTC out (Program or message)","10:00:08:00","Segment8",null,"TC_OUT_SEG",null,"TC","x",null,null,"OUI / YES"]
[null,null,null,null,null,null,null,null,null,null,4]
[null,"Description de la partie 9 / \nPart 9 description",null,null,null,null,null,null,null,null,4]
[null,"Numéro de partie / Part number",9,"Segment9",null,"SEG_ID",null,null,"x",null,null,"OUI / YES"]
[null,"TC in (Programme ou message) / \nTC in (Program or message)","10:08:00:01","Segment9",null,"TC_IN_SEG",null,"TC","x",null,null,"OUI / YES"]
[null,"TC out (Programme ou message) / \nTC out (Program or message)","10:09:00:00","Segment9",null,"TC_OUT_SEG",null,"TC","x",null,null,"OUI / YES"]
[null,null,null,null,null,null,null,null,null,null,4]
[null,"Description de la partie 10 / \nPart 10 description",null,null,null,null,null,null,null,null,4]
[null,"Numéro de partie / Part number",10,"Segment10",null,"SEG_ID",null,null,"x",null,null,"OUI / YES"]
[null,"TC in (Programme ou message) / \nTC in (Program or message)","10:09:00:01","Segment10",null,"TC_IN_SEG",null,"TC","x",null,null,"OUI / YES"]
[null,"TC out (Programme ou message) / \nTC out (Program or message)","11:00:00:00","Segment10",null,"TC_OUT_SEG",null,"TC","x",null,null,"OUI / YES"]
[null,null,null,null,null,null,null,null,null,null,4]
[null,"Description des sous-titres / \nSubtitles description",null,null,null,null,null,null,null,null,null,null,null,"Merci de compléter la description des sous-titres présents","Fill the description of the existing subtitles"]
[null,"Nb de sous-titres / Number of subtitles",0,"Subtitle",null,"Number_ST","x",null,"x","OldNbST -->",0,"OUI / YES"]
[]
[null,"Description Sous-titre 1 / \nSubtitle 1 description",null,null,null,null,null,null,null,null,4]
[null,"ST id",1,"subtitle1",null,"Subtitling_ID",null,null,"x",null,null,"OUI / YES"]
[null,"Type de sous-titre / Subtitle Type","Fichier joint","subtitle1",null,"SubtitlingType",null,null,"x",null,null,"OUI / YES"]
[null,"Version de sous-titre / Subtitle version","Malentendant","subtitle1",null,"SubtitlingVersion",null,null,"x",null,null,"OUI / YES"]
[null,"Code langue / Language code","Français","subtitle1",null,null,null,null,"x",null,null,"OUI / YES"]
[null,"Code langue / Language code",{"$f":"IF(C109<>\"\",VLOOKUP(C109,'Listes de données'!$A$2:$B$420,2,FALSE),\"\")","v":"FRA"},"subtitle1",null,"LanguageCode"]
[]
[null,"Description Sous-titre 2 / \nSubtitle 2 description"]
[null,"ST id",2,"subtitle2",null,"Subtitling_ID",null,null,"x",null,null,"OUI / YES"]
[null,"Type de sous-titre / Subtitle Type","Fichier joint","subtitle2",null,"SubtitlingType",null,null,"x",null,null,"OUI / YES"]
[null,"Version de sous-titre / Subtitle version","Standard","subtitle2",null,"SubtitlingVersion",null,null,"x",null,null,"OUI / YES"]
[null,"Code langue / Language code","Français","subtitle2",null,null,null,null,"x",null,null,"OUI / YES"]
[null,"Code langue / Language code",{"$f":"IF(C116<>\"\",VLOOKUP(C116,'Listes de données'!$A$2:$B$420,2,FALSE),\"\")","v":"FRA"},"subtitle2",null,"LanguageCode"]
[]
[null,"Description de la vidéo / Video description"]
[null,"Format d'image / Picture Format",1.77,"Vidéo",null,"OriginalPictureFormat","x",null,"x",null,null,"OUI / YES"]
[null,"Format vidéo - Aspect Ratio / \nVideo Format - Aspect Ration","16/9","Vidéo",null,"VideoPictureFormat","x",null,"x",null,null,"OUI / YES"]
[null,"Résolution / Resolution","HD","Vidéo",null,"VideoProfile","x",null,"x",null,null,"OUI / YES"]
[null,"Codec vidéo","XDCAM HD","Vidéo",null,"Codec",null,null,null,null,null,"NON"]
[null,"BitRate",50000000,"Vidéo",null,"BitRate",null,null,null,null,null,"NON"]
[null,"Width",1920,"Vidéo",null,"Width"]
[null,"Height",1080,"Vidéo",null,"Height",null,null,null,null,null,"NON"]
[null,"FrameRate",25,"Vidéo",null,"FrameRate",null,null,null,null,null,"NON"]
[null,"ScanningMode","I","Vidéo",null,"ScanningMode",null,null,null,null,null,"NON"]
[null,"3DContent","False","Vidéo",null,"Stereo3D",null,null,"x",null,null,"NON / NO"]
[null,"3DMode",null,"Vidéo",null,"Stereo3DMode",null,null,"x",null,null,"NON / NO"]
[]
[null,"Description de l'audio / Audio Description ",null,null,null,null,null,null,null,null,null,null,null,"Merci de compléter la description des paires audio présentes","Fill the description of the existing audio pairs"]
[null,"Nombre de canaux présents dans le fichier / \nNumber of file channels (FileChannelCount)",8,"Audio",null,"FileChannelCount","x",null,"x",null,null,"OUI / YES"]
[null,"Quantification audio, Profondeur d'audio / \nAudio quantification, Audio depth",24,"Audio",null,"FileBitDepth","x",null,"x",null,null,"OUI / YES"]
[null,"Type de piste audio","AES3","Audio",null,"FileTrackType",null,null,"x",null,null,"NON / NO"]
[null,"Nombre de paires audio exploitées\npour déclarer une VF avec DolbyE (paires 1 et 3) mettre 3 / Number of used audio pairs\nTo declare a VF with DolbyE (pair 1 and pair 3) fill 3",2,"Audio",null,"Number_audio","x",null,null,"OldNbAES -->",4,"OUI / YES"]
[]
[null,"Description Paire audio 1 / \nAudio pair 1 description"]
[null,"N° Paire / Pair number",1,"Audio1","A1","Stream_ID",null,"A","x",null,null,"OUI / YES"]
[null,"Type d'Audio / Audio Type","Audio_PCM","Audio1","A1_Type","AudioType",null,"A","x",null,null,"OUI / YES"]
[null,"Pgm 1 - Version / Pgm 1 - Version","VF","Audio1","A1_St","Version",null,"A","x",null,null,"OUI / YES",null,"Unused = Mute"]
[null,"Pgm 1 - Langue/ Pgm 1 - Language","Français","Audio1","A1_St",null,null,"A","x",null,null,"OUI / YES"]
[null,"CodeLangue / Language Code",{"$f":"IF(C142<>\"\",VLOOKUP(C142,'Listes de données'!$A$2:$B$420,2,FALSE),\"\")","v":"FRA"},"Audio1",null,"LanguageCode",null,"A"]
[null,"Loudness",null,"Audio1","A1_St","Loudness","o",null,"x",null,null,"OUI / YES"]
[null,"DolbyDialogLevel  (si DOLBY E)",1,"Audio1","A1_dE","DolbyDialogLevel",null,null,"x",null,null,"NON / NO"]
[null,"DolbyDialogLevelMetadata (si DOLBY E)",2,"Audio1","A1_dE","DolbyDialogLevelMetadata",null,null,"x",null,null,"NON / NO"]
[null,"Pgm 1 - Type de mixage (si DOLBY E) / \nPgm 1 - mix type (if DOLBY E)","5.1","Audio1_dE","A1_dE","MixType",null,"A","x",null,null,"OUI si DolbyE / YES if DolbyE"]
[null,"Pgm 2 - Version (si DOLBY E) / \nPgm 2 - Version (if DOLBY E)","VF","Audio1_dE","A1_dE","Version",null,"A","x",null,null,"OUI si DolbyE / YES if DolbyE"]
[null,"Pgm 2 - Langue (si DOLBY E) / \nPgm 2 - Language (if DOLBY E)","Français","Audio1_dE","A1_dE",null,null,"A","x",null,null,"OUI si DolbyE / YES if DolbyE"]
[null,"CodeLangue",{"$f":"IF(C149<>\"\",VLOOKUP(C149,'Listes de données'!$A$2:$B$420,2,FALSE),\"\")","v":"FRA"},"Audio1_dE",null,"LanguageCode",null,"A"]
[null,"Pgm 2 - Loudness (si DOLBY E)",-25.5,"Audio1_dE","A1_dE","Loudness","o",null,"x",null,null,"OUI si DolbyE / YES if DolbyE"]
[null,"Pgm 2 - DolbyDialogLevel  (si DOLBY E)",4,"Audio1_dE","A1_dE","DolbyDialogLevel",null,null,"x",null,null,"NON / NO"]
[null,"Pgm 2 - DolbyDialogLevelMetadata (si DOLBY E)",5,"Audio1_dE","A1_dE","DolbyDialogLevelMetadata",null,null,"x",null,null,"NON / NO"]
[]
[null,"Description Paire audio 2 / \nAudio pair 2 description"]
[null,"N° Paire / Pair number",2,"Audio2","A2","Stream_ID",null,"A","x",null,null,"OUI / YES"]
[null,"Type d'Audio / Audio Type","Audio_PCM","Audio2","A2_Type","AudioType",null,"A","x",null,null,"OUI / YES"]
[null,"Pgm 1 - Version / Pgm 1 - Version","VO","Audio2","A2_St","Version",null,"A","x",null,null,"OUI / YES",null,"Unused = Mute"]
[null,"Pgm 1 - Langue/ Pgm 1 - Language","Anglais","Audio2","A2_St",null,null,"A","x",null,null,"OUI / YES"]
[null,"CodeLangue / Language Code",{"$f":"IF(C159<>\"\",VLOOKUP(C159,'Listes de données'!$A$2:$B$420,2,FALSE),\"\")","v":"ENG"},"Audio2",null,"LanguageCode",null,"A"]
[null,"Loudness",null,"Audio2","A2_St","Loudness","o",null,"x",null,null,"OUI / YES"]
[null,"DolbyDialogLevel  (si DOLBY E)",null,"Audio2","A2_dE","DolbyDialogLevel",null,null,"x",null,null,"NON / NO"]
[null,"DolbyDialogLevelMetadata (si DOLBY E)",null,"Audio2","A2_dE","DolbyDialogLevelMetadata",null,null,"x",null,null,"NON / NO"]
[null,"Pgm 1 - Type de mixage (si DOLBY E) / \nPgm 1 - mix type (if DOLBY E)","5.1","Audio2_dE","A2_dE","MixType",null,"A","x",null,null,"OUI si DolbyE / YES if DolbyE"]
[null,"Pgm 2 - Version (si DOLBY E) / \nPgm 2 - Version (if DOLBY E)","VF ","Audio2_dE","A2_dE","Version",null,"A","x",null,null,"OUI si DolbyE / YES if DolbyE"]
[null,"Pgm 2 - Langue (si DOLBY E) / \nPgm 2 - Language (if DOLBY E)","Français (1400-1600)","Audio2_dE","A2_dE",null,null,"A","x",null,null,"OUI si DolbyE / YES if DolbyE"]
[null,"CodeLangue / Language Code",{"$f":"IF(C166<>\"\",VLOOKUP(C166,'Listes de données'!$A$2:$B$420,2,FALSE),\"\")","v":"FRM"},"Audio2_dE",null,"LanguageCode",null,"A"]
[null,"Pgm 2 - Loudness (si DOLBY E)",-2.4,"Audio2_dE","A2_dE","Loudness","o",null,"x",null,null,"OUI si DolbyE"]
[null,"Pgm 2 - DolbyDialogLevel  (si DOLBY E)",null,"Audio2_dE","A2_dE","DolbyDialogLevel",null,null,"x",null,null,"NON / NO"]
[null,"Pgm 2 - DolbyDialogLevelMetadata (si DOLBY E)",null,"Audio2_dE","A2_dE","DolbyDialogLevelMetadata",null,null,"x",null,null,"NON / NO"]
[]
[null,"Description Paire audio 3 / \nAudio pair 3 description"]
[null,"N° Paire / Pair number",3,"Audio3","A3","Stream_ID",null,"A","x",null,null,"OUI / YES"]
[null,"Type d'Audio / Audio Type","Non exploité","Audio3","A3_Type","AudioType",null,"A","x",null,null,"OUI / YES"]
[null,"Pgm 1 - Version / Pgm 1 - Version","VF","Audio3","A3_St","Version",null,"A","x",null,null,"OUI / YES",null,"Unused = Mute"]
[null,"Pgm 1 - Langue/ Pgm 1 - Language","Français","Audio3","A3_St",null,null,"A","x",null,null,"OUI / YES"]
[null,"CodeLangue / Language Code",{"$f":"IF(C176<>\"\",VLOOKUP(C176,'Listes de données'!$A$2:$B$420,2,FALSE),\"\")","v":"FRA"},"Audio3",null,"LanguageCode",null,"A"]
[null,"Loudness",null,"Audio3","A3_St","Loudness","o",null,"x",null,null,"OUI / YES"]
[null,"DolbyDialogLevel  (si DOLBY E)",null,"Audio3","A3_dE","DolbyDialogLevel",null,null,"x",null,null,"NON / NO"]
[null,"DolbyDialogLevelMetadata (si DOLBY E)",null,"Audio3","A3_dE","DolbyDialogLevelMetadata",null,null,"x",null,null,"NON / NO"]
[null,"Pgm 1 - Type de mixage (si DOLBY E) / \nPgm 1 - mix type (if DOLBY E)","5.1","Audio3_dE","A3_dE","MixType",null,"A","x",null,null,"OUI si DolbyE / YES if DolbyE"]
[null,"Pgm 2 - Version (si DOLBY E) / \nPgm 2 - Version (if DOLBY E)","VF","Audio3_dE","A3_dE","Version",null,"A","x",null,null,"OUI si DolbyE / YES if DolbyE"]
[null,"Pgm 2 - Langue (si DOLBY E) / \nPgm 2 - Language (if DOLBY E)","Français","Audio3_dE","A3_dE",null,null,"A","x",null,null,"OUI si DolbyE / YES if DolbyE"]
[null,"CodeLangue / Language Code",{"$f":"IF(C183<>\"\",VLOOKUP(C183,'Listes de données'!$A$2:$B$420,2,FALSE),\"\")","v":"FRA"},"Audio3_dE",null,"LanguageCode",null,"A"]
[null,"Pgm 2 - Loudness (si DOLBY E)",-2.4,"Audio3_dE","A3_dE","Loudness","o",null,"x",null,null,"OUI si DolbyE / YES if DolbyE"]
[null,"Pgm 2 - DolbyDialogLevel  (si DOLBY E)",null,"Audio3_dE","A3_dE","DolbyDialogLevel",null,null,"x",null,null,"NON / NO"]
[null,"Pgm 2 - DolbyDialogLevelMetadata (si DOLBY E)",null,"Audio3_dE","A3_dE","DolbyDialogLevelMetadata",null,null,"x",null,null,"NON / NO"]
[]
[null,"Description Paire audio 4"]
[null,"N° Paire / Pair number",4,"Audio4","A4","Stream_ID",null,"A","x",null,null,"OUI / YES"]
[null,"Type d'Audio / Audio Type","Non exploité","Audio4","A4_Type","AudioType",null,"A","x",null,null,"OUI / YES"]
[null,"Pgm 1 - Version / Pgm 1 - Version","VO","Audio4","A4_St","Version",null,"A","x",null,null,"OUI / YES",null,"Unused = Mute"]
[null,"Pgm 1 - Langue/ Pgm 1 - Language","Anglais","Audio4","A4_St",null,null,"A","x",null,null,"OUI / YES"]
[null,"CodeLangue / Language Code",{"$f":"IF(C193<>\"\",VLOOKUP(C193,'Listes de données'!$A$2:$B$420,2,FALSE),\"\")","v":"ENG"},"Audio4",null,"LanguageCode",null,"A"]
[null,"Loudness",null,"Audio4","A4_St","Loudness","o",null,"x",null,null,"OUI / YES"]
[null,"DolbyDialogLevel  (si DOLBY E)",null,"Audio4","A4_dE","DolbyDialogLevel",null,null,"x",null,null,"NON / NO"]
[null,"DolbyDialogLevelMetadata (si DOLBY E)",null,"Audio4","A4_dE","DolbyDialogLevelMetadata",null,null,"x",null,null,"NON / NO"]
[null,"Pgm 1 - Type de mixage (si DOLBY E) / \nPgm 1 - mix type (if DOLBY E)","5.1","Audio4_dE","A4_dE","MixType",null,"A","x",null,null,"OUI si DolbyE / YES if DolbyE"]
[null,"Pgm 2 - Version (si DOLBY E) / \nPgm 2 - Version (if DOLBY E)","VO","Audio4_dE","A4_dE","Version",null,"A","x",null,null,"OUI si DolbyE / YES if DolbyE"]
[null,"Pgm 2 - Langue (si DOLBY E) / \nPgm 2 - Language (if DOLBY E)","Anglais","Audio4_dE","A4_dE",null,null,"A","x",null,null,"OUI si DolbyE / YES if DolbyE"]
[null,"CodeLangue",{"$f":"IF(C200<>\"\",VLOOKUP(C200,'Listes de données'!$A$2:$B$420,2,FALSE),\"\")","v":"ENG"},"Audio4_dE",null,"LanguageCode",null,"A"]
[null,"Pgm 2 - Loudness (si DOLBY E)",-2.4,"Audio4_dE","A4_dE","Loudness","o",null,"x",null,null,"OUI si DolbyE / YES if DolbyE"]
[null,"Pgm 2 - DolbyDialogLevel  (si DOLBY E)",null,"Audio4_dE","A4_dE","DolbyDialogLevel",null,null,"x",null,null,"NON / NO"]
[null,"Pgm 2 - DolbyDialogLevelMetadata (si DOLBY E)",null,"Audio4_dE","A4_dE","DolbyDialogLevelMetadata",null,null,"x",null,null,"NON / NO"]

{"sheet":"Languages","index":2,"n_rows":420,"n_cols":3,"rows_kept":420,"cut":false,"hidden":true,"merged":[]}
["langue","language","Code Antenne"]
["Abkhaze","Abkhaz","ABK"]
["Aceh","Aceh","ACE"]
["Acoli","Acoli","ACH"]
["Adangme","adangme","ADA"]
["Afar","Afar","AAR"]
["Afrihili","Afrihili","AFH"]
["Afrikaans","Afrikaans","AFR"]
["Afro-asiatiques","Afro-Asian","AFA"]
["Akan","Akan","AKA"]
["Akkadien","Akkadian","AKK"]
["Albanais","Albanian","ALB"]
["Aléoute","Aleut","ALE"]
["Algonquines","Algonquin","ALG"]
["Aljamia","Aljamia","AJM"]
["Allemand","German","DEU"]
["Allemand (1050-1500)","German (1050-1500)","GMH"]
["Allemand (750-1050)","German (750-1050)","GOH"]
["Altaïques","Altaic","TUT"]
["Amharique","Amharic","AMH"]
["Anglais","English","ENG"]
["Anglais (1100-1500)","English (1100-1500)","TNM"]
["Anglo-saxon 450-1100","Anglo- Saxon 450-1100","ANG"]
["Apache","Apache","APA"]
["Arabe","Arabic","ARA"]
["Araméen","Aramaic","ARC"]
["Arapaho","Arapaho","ARP"]
["Araucan","Araucanian","ARN"]
["Arawak","Arawak","ARW"]
["Arménien","Armenian","ARM"]
["Artificielles","artificial","ART"]
["Assamais","Assamese","ASM"]
["Athapascanes","Athapaskan","ATH"]
["Avar","Avar","AVA"]
["Avestique","Avestan","AVE"]
["Awadhi","Awadhi","AWA"]
["Aymara","Aymara","AYM"]
["Azéri","Azeri","AZE"]
["Bachkir","Bashkir","BAK"]
["Balinais","Balinese","BAN"]
["Baloutchi","Baluchi","BAL"]
["Baltiques","Baltic","BAT"]
["Bambara","Bambara","BAM"]
["Bamilékés","Bamilékés","BAI"]
["Banda","Banda","BAD"]
["Bantoues","Bantu","BNT"]
["Basa","Basa","BAS"]
["Basque","Basque","BAQ"]
["Bedja","Beja","BEJ"]
["Bemba","Bemba","BEM"]
["Bengali","Bengali","BEN"]
["Berbères","Berber","BER"]
["Bhojpuri","Bhojpuri","BHO"]
["Bichlamar","Bislama","BIS"]
["Biélorusse","Belarusian","BEL"]
["Bihari","Bihari","BIH"]
["Bikol","Bikol","BIK"]
["Bini","Bini","BIN"]
["Birman","Burmese","BUR"]
["Blackfoot","Blackfoot","BLA"]
["bosniaque","Bosnian","BOS"]
["Bouriate","Buryat","BUA"]
["Braj","Braj","BRA"]
["Breton","Breton","BRE"]
["Bugi","bugi","BUG"]
["Bulgare","Bulgarian","BUL"]
["Caddo","Caddo","CAD"]
["Cantonais","Cantonese","CTN"]
["Caribe","Caribe","CAR"]
["Catalan","Catalan","CAT"]
["Caucasiennes","Caucasian","CAU"]
["Cebuano","Cebuano","CEB"]
["Celtiques","Celtic","CEL"]
["Chamorro","Chamorro","CHA"]
["Chan","Chan","SHN"]
["Cherokee","Cherokee","CHR"]
["Cheyenne","Cheyenne","CHY"]
["Chibcha","Chibcha","CHB"]
["Chinois","Chinese","CHI"]
["Chinook, jargon","Chinook jargon","CHN"]
["Choctaw","Choctaw","CHO"]
["Cinghalais","Sinhala","SIN"]
["Copte","Copt","COP"]
["Coréen","Korean","KOR"]
["Cornique","Cornish","COR"]
["Corse","Corsica","COS"]
["Couchitiques","Cushitic","CUS"]
["Cree","Cree","CRE"]
["Créoles pidgins angl","Creole pidgin Engl","CPE"]
["Créoles pidgins div","Pidgins Creoles div","CRP"]
["Créoles pidgins fran","Pidgin Creole French","CPF"]
["Créoles pidgins port","Pidgins Creoles harbor","CPP"]
["Dakota","Dakota","DAK"]
["Danois","Danish","DAN"]
["Delaware","Delaware","DEL"]
["Dinka","Dinka","DIN"]
["Dioula","Jula","DYU"]
["Diverses","various","MIS"]
["Djaghataï","Chaghatai","CHG"]
["Dogri","Dogri","DOI"]
["dogrib","Dogrib","DGR"]
["Douala","Douala","DUA"]
["Dravidiennes","Dravidian","DRA"]
["Dzongkha","Dzongkha","DZO"]
["Ecossais","Scots","SCO"]
["Efik","Efik","EFI"]
["Egyptien","Egyptian","EGY"]
["Ekajuk","Ekajuk","EKA"]
["Elamite","Elamite","ELX"]
["English","English","ENM"]
["Espagnol","Spanish","ESL"]
["Esperanto","Esperanto","EPO"]
["Estonien","Estonian","EST"]
["Ethiopic","Ethiopic","ETH"]
["Ewé","Ewe","EWE"]
["Ewondo","ewondo","EWO"]
["Fang","Fang","FAN"]
["Fanti","Fanti","FAT"]
["Féroïen","Faroese","FAO"]
["Fidjien","Fiji","FIJ"]
["Finnois","Finnish","FIN"]
["Finno-ougriennes","Finno -Ugric","FIU"]
["Flamand","Flemish","FLE"]
["Fon","Fon","FON"]
["Français","French","FRA"]
["Français (1400-1600)","French (1400-1600)","FRM"]
["Français (842-1400)","French (842-1400)","FRO"]
["Français-québécois","French - Quebec","FRQ"]
["frioulan","Friulian","FUR"]
["Frison","Frisian","FRY"]
["Ga","Ga","GAA"]
["Gaélique d'Ecosse","Scottish Gaelic","GAE"]
["Galicien","Galician","GLG"]
["Galla","Galla","ORM"]
["Gallois","Welsh","CYM"]
["Ganda","Ganda","LUG"]
["Gayo","Gayo","GAY"]
["Géorgien","Georgian","GEO"]
["Germaniques","Germanic","GEM"]
["Gond","hinge","GON"]
["Gothique","gothic","GOT"]
["Goudjrati","Gujarati","GUJ"]
["Grebo","Grebo","GRB"]
["Grec","Greek","ELL"]
["Grec (jusqu'à 1453)","Greek ( to 1453 )","GRC"]
["Groenlandais","Greenlandic","KAL"]
["Guarani","Guarani","GRN"]
["Guèze","Geez","GEZ"]
["Haida","Haida","HAI"]
["Haoussa","Hausa","HAU"]
["Hawaïen","hawaiian","HAW"]
["Hébreu","Hebrew","HEB"]
["Herero","Herero","HER"]
["Hiligaynon","Hiligaynon","HIL"]
["Himachali","Himachali","HIM"]
["Hindi","Hindi","HIN"]
["Hiri Motu","Hiri Motu","HMO"]
["Hongrois","Hungarian","HUN"]
["Hupa","Hupa","HUP"]
["Iakoute","Yakut","SAH"]
["Iban","Iban","IBA"]
["Igbo","Igbo","IBO"]
["Ijo","Ijo","IJO"]
["Ilocano","Ilocano","ILO"]
["Indéterminée","indefinite","UND"]
["Indéterminée","indefinite","ZZZ"]
["Indiennes Amé centra","Indian Amer centra","CAI"]
["Indiennes Amé du Nor","Nor the Indian Amer","NAI"]
["Indiennes Amé du Sud","Indian South Amer","SAI"]
["Indo-aryennes","Indo -Aryan","INC"]
["Indo-européennes","Indo-European","INE"]
["Indonésien","Indonesian","IND"]
["Interlingua","Interlingua","INA"]
["Interlingue","interlingue","ILE"]
["Inuit","Inuit","ESK"]
["Inuktitut","Inuktitut","IKU"]
["Inupiak","Inupiaq","IPK"]
["Iraniennes","Iranian","IRA"]
["Irlandais","Irish","GAI"]
["Irlandais (900-1200)","Irish (900-1200)","MGA"]
["Irlandais jusqu 900","Irish up 900","SGA"]
["Iroquoises (famille)","Iroquois ( family)","IRO"]
["Islandais","Icelandic","ICE"]
["Italien","Italian","ITA"]
["Japonais","Japanese","JPN"]
["Javanais","Javanese","JAV"]
["Judéo-arabe","Jewish-Arab","JRB"]
["Judéo-espagnol","Judeo-Spanish","LAD"]
["Judéo-persan","Judeo-Persian","JPR"]
["Kabyle","Kabyle","KAB"]
["Kachin","Kachin","KAC"]
["Kamba","Kamba","KAM"]
["Kannada","kannada","KAN"]
["Kanouri","Kanuri","KAU"]
["Karakalpak","Karakalpak","KAA"]
["Karen","Karen","KAR"]
["Kashmiri","Kashmiri","KAS"]
["Kawi","Kawi","KAW"]
["Kazakh","Kazakh","KAZ"]
["Khai","Khai","KHA"]
["Khmer","Khmer","KHM"]
["Khoisan","Khoisan","KHI"]
["Khotanais","Khotanese","KHO"]
["Kikuyu","Kikuyu","KIK"]
["Kirghiz","Kirghiz","KIR"]
["Kiribati","Kiribati","GIL"]
["Komi","Komi","KOM"]
["Kongo","Kongo","KON"]
["Konkani","Konkani","KOK"]
["Koumyk","Kumyk","KUM"]
["Kpellé","Kpelle","KPE"]
["Kru","Kru","KRO"]
["Kuanyama","Kuanyama","KUA"]
["Kurde","Kurdish","KUR"]
["Kurukh","Kurukh","KRU"]
["Kusaie","Kusaie","KUS"]
["Kutenai","Kutenai","KUT"]
["Lahnda","Lahnda","LAH"]
["Lamba","Lamba","LAM"]
["Lao","Lao","LAO"]
["Lapon","Lapp","SMI"]
["Lapp languages","Lapp languages","LAP"]
["Latin","Latin","LAT"]
["Lette","Latvian","LAV"]
["Lezghien","Lezghien","LEZ"]
["Lingala","Lingala","LIN"]
["Lithuanien","Lithuanian","LIT"]
["Lozi","Lozi","LOZ"]
["Luba","Luba","LUB"]
["Luiseno","luiseno","LUI"]
["Lunda","Lunda","LUN"]
["Luo (Kenya Tanzanie)","Luo (Kenya Tanzania)","LUO"]
["Luxembourgeois","Luxembourg","LTZ"]
["Macédonien","Macedonian","MAC"]
["Madourais","Madurese","MAD"]
["Magahi","magahi","MAG"]
["Maithili","Maithili","MAI"]
["Makassar","Makassar","MAK"]
["Malais","Malay","MAY"]
["Malayalam","Malayalam","MAL"]
["Malayo-polynésienne","Malayo -Polynesian","MAP"]
["Maldivien","Maldivian","DIV"]
["Malgache","Malagasy","MLG"]
["Maltais","Maltese","MLT"]
["Mandarin","Mandarin","MDR"]
["Mandingue","Mandingo","MAN"]
["Manipuri","Manipuri","MNI"]
["Manobo","Manobo","MNO"]
["Manx","Manx","MAX"]
["Maori","Maori","MAO"]
["Marathe","Marathi","MAR"]
["Mari","husband","CHM"]
["Marshall","Marshall","MAH"]
["Marvari","Marwaris","MWR"]
["Masai","Masai","MAS"]
["Maya","Maya","MYN"]
["Mendé","Mende","MEN"]
["Micmac","Micmac","MIC"]
["Minangkabau","Minangkabau","MIN"]
["Mohawk","Mohawk","MOH"]
["Moldave","Moldovan","MOL"]
["Mongo","Mongo","LOL"]
["Mongol","Mongolian","MON"]
["Môn-khmer","Mon-Khmer","MKH"]
["Mossi","Mossi","MOS"]
["Mounda","Munda","MUN"]
["Muet","mute","MUE"]
["Multilingue","multilingual","MUL"]
["Muskogee","Muskogee","MUS"]
["Nahuatl","Nahuatl","NAH"]
["Nauru","Nauru","NAU"]
["Navaho","Navaho","NAV"]
["Ndébélé du Nord","Ndebele North","NDE"]
["Ndébélé du Sud","Ndebele South","NBL"]
["Ndonga","Ndonga","NDO"]
["Néerlan 1050-1350","Dutch 1050-1350","DUM"]
["Néerlandais","Dutch","DUT"]
["Népalais","Nepalese","NEP"]
["Newari","Newari","NEW"]
["Nigéro-congolaises","Niger-Congo","NIC"]
["Nilo-sahariennes","Nilo -Saharan","SSA"]
["Niué","Niue","NIU"]
["Norrois, vieux","Norse, Old","NON"]
["Norvégien","Norwegian","NOR"]
["Norvégien (Nynorsk)","Norwegian ( Nynorsk)","NNO"]
["norvégien bokmål","Norwegian Bokmål","NOB"]
["Nubiennes","Nubian","NUB"]
["Nyamwezi","nyamwezi","NYM"]
["Nyanja","Nyanja","NYA"]
["Nyankolé","nyankole","NYN"]
["Nyoro","Nyoro","NYO"]
["Nzema","Nzema","NZI"]
["Occitan","Occitan","OCI"]
["Ojibwa","Ojibwa","OJI"]
["Oriya","Oriya","ORI"]
["Osage","Osage","OSA"]
["Ossète","Ossetian","OSS"]
["Otomangue","Otomangue","OTO"]
["Ougaritique","Ugaritic","UGA"]
["Ouïgour","Uighur","UIG"]
["Ouzbek","Uzbek","UZB"]
["Pachto","Pashto","PUS"]
["Pahlavi","Pahlavi","PAL"]
["Palau","Palau","PAU"]
["Pali","Pali","PLI"]
["Pampangan","Pampangan","PAM"]
["Pangasinan","Pangasinan","PAG"]
["Papiamento","Papiamento","PAP"]
["Papoues-australienne","Papuan -Australian","PAA"]
["Pendjabi","Punjabi","PAN"]
["Persan","Persian","FAS"]
["Perse (600-400 avJC)","Persia ( 600-400 avJC )","PEO"]
["Peul","Peul","FUL"]
["Phénicien","Phoenician","PHN"]
["philippines, autres ","philippines, other","PHI"]
["Polonais","Polish","POL"]
["Ponape","Ponape","PON"]
["Portugais","Portuguese","POR"]
["Prâkrit","Prakrit","PRA"]
["Provençal jusqu 1500","Provence until 1500","PRO"]
["Quechua","Quechua","QUE"]
["Rajasthani","Rajasthani","RAJ"]
["Rarotonga","Rarotonga","RAR"]
["Rhéto-roman","Rhaeto-romance","ROH"]
["Romanes","Romance","ROA"]
["Roumain","Romanian","RON"]
["Rundi","rundi","RUN"]
["Russe","Russian","RUS"]
["Rwanda","Rwanda","KIN"]
["Salish","Salish","SAL"]
["Samaritain","Samaritan","SAM"]
["Samoan","Samoan","SMO"]
["Sandawe","sandawe","SAD"]
["Sango","Sango","SAG"]
["Sanskrit","Sanskrit","SAN"]
["Sarde","Sarde","SRD"]
["Selkoup","Selkups","SEL"]
["Sémitiques","Semitic","SEM"]
["serbe","Serbian","SCC"]
["Serbo-croate","Serbo- Croatian","SCR"]
["Sérère","Serere","SRR"]
["Shona","Shona","SNA"]
["Sidamo","Sidamo","SID"]
["Sindhi","Sindhi","SND"]
["Sino-tibétaines","Sino -Tibetan","SIT"]
["Sioux","Sioux","SIO"]
["Slaves","Slaves","SLA"]
["Slavon","Slavonic","CHU"]
["Slovaque","Slovak","SLK"]
["Slovène","Slovenian","SLV"]
["Sogdien","Sogdien","SOG"]
["Somali","Somali","SOM"]
["Son international","its international","INT"]
["Songhai","Songhai","SON"]
["Sotho du Nord","Northern Sotho","NSO"]
["Sotho du Sud","South Sotho","SOT"]
["Soundanais","Sundanese","SUN"]
["Soussou","Susu","SUS"]
["Suédois","Swedish","SVE"]
["Sukuma","Sukuma","SUK"]
["Sumérien","Sumerian","SUX"]
["Swahili","Swahili","SWA"]
["Swazi","Swazi","SSW"]
["Syriaque","Syriac","SYR"]
["Tadjik","Tajik","TGK"]
["Tagalog","Tagalog","TGL"]
["Tahitien","Tahitian","TAH"]
["Tamacheq","Tamacheq","TMH"]
["Tamoul","Tamil","TAM"]
["Tatar","Tatar","TAT"]
["Tchèque","Czech","CES"]
["Tchetchène","Chechen","CHE"]
["Tchouvache","Chuvash","CHV"]
["Télugu","Telugu","TEL"]
["Temne","Temne","TEM"]
["Tereno","Tereno","TER"]
["Thaï","Thai","THA"]
["thaïes, autres langu","Thai , other langu","TAI"]
["Tibétain","Tibetan","BOD"]
["Tigré","tabby","TIG"]
["Tigrigna","Tigrigna","TIR"]
["Tiv","Tiv","TIV"]
["Tlingit","Tlingit","TLI"]
["Tonga","Tonga","TON"]
["Tonga (Nyasa)","Tonga ( Nyasa )","TOG"]
["Touva","Tuva","TYV"]
["Truk","Truk","TRU"]
["Tsigane","Gypsy","ROM"]
["Tsimshian","Tsimshian","TSI"]
["Tsonga","Tsonga","TSO"]
["Tswana","Tswana","TSN"]
["Tumbuka","Tumbuka","TUM"]
["Turc","Turkish","TUR"]
["Turc ottom 1500-1928","Turkish ottom 1500-1928","OTA"]
["Turkmène","Turkmen","TUK"]
["Twi","Twi","TWI"]
["Ukrainien","Ukrainian","UKR"]
["Umbundu","umbundu","UMB"]
["Urdu","Urdu","URD"]
["Vaï","Vai","VAI"]
["Venda","Venda","VEN"]
["Vietnamien","Vietnamese","VIE"]
["Volapük","Volapük","VOL"]
["Vote","vote","VOT"]
["Wakashennes","Wakashennes","WAK"]
["Walamo","Walamo","WAL"]
["Waray","Waray","WAR"]
["Washo","Washo","WAS"]
["Wenda","Wenda","WEN"]
["Wolof","Wolof","WOL"]
["Xhosa","Xhosa","XHO"]
["Yao","Yao","YAO"]
["Yapois","Yapese","YAP"]
["Yiddish","Yiddish","YID"]
["Yoruba","Yoruba","YOR"]
["Zapothèque","Zapothèque","ZAP"]
["Zenaga","Zenaga","ZEN"]
["Zhuang","Zhuang","ZHA"]
["Zoulou","Zulu","ZUL"]
["Zuni","Zuni","ZUN"]

{"sheet":"Liste des balises","index":3,"n_rows":105,"n_cols":6,"rows_kept":105,"cut":false,"hidden":true,"merged":[]}
["Balise","Parent","Saisie / auto","Obligatoire"]
["Descriptive",null,"A","x",null,1]
["BroadcasterPrivateID","Descriptive","S","x",null,2]
["Unique_PAD_ID","Descriptive",null,null,null,3]
["BroadcasterName","Descriptive","S",null,null,4]
["PostHouseName","Descriptive","S","x",null,5]
["ProgramNature","Descriptive",null,"x",null,6]
["ProgramType","Descriptive",null,"x",null,7]
["ProgramTitle","Descriptive",null,"x",null,8]
["ProgramSecondTitle","Descriptive",null,null,null,9]
["VO_ProgramTitle","Descriptive",null,null,null,10]
["VO_ProgramSecondTitle","Descriptive",null,null,null,11]
["Revision_ID","Descriptive",null,"x",null,12]
["EditorialVersion","Descriptive",null,null,null,13]
["ProgramDuration","Descriptive",null,"x",null,14]
["ProductionDate","Descriptive",null,null,null,15]
["EpisodeNumber","Descriptive",null,null,null,16]
["ClientPartNum","Descriptive",null,"x",null,17]
["ClientPartTotal","Descriptive",null,"x",null,18]
["AgencyName","Descriptive",null,null,null,19]
["AdvertiserName","Descriptive",null,null,null,20]
["ProductName","Descriptive",null,null,null,21]
["pad:Technical",null,"A","x",null,22]
["Diffusion_ID","pad:Technical",null,null,null,23]
["Master_SupportType","pad:Technical",null,null,null,24]
["PAD_SupportType","pad:Technical",null,null,null,25]
["SupportNature","pad:Technical",null,null,null,26]
["Material_ID","pad:Technical",null,null,null,27]
["CST_RT17_Version","pad:Technical",null,null,null,28]
["TC_IN_Header","pad:Technical",null,"x",null,29]
["TC_OUT_Footer","pad:Technical",null,"x",null,30]
["TC_IN_PGM","pad:Technical",null,"x",null,31]
["TC_OUT_PGM","pad:Technical",null,"x",null,32]
["Video_remarks","pad:Technical",null,null,null,33]
["Audio_remarks","pad:Technical",null,null,null,34]
["Other_remarks","pad:Technical",null,null,null,35]
["Remarks","pad:Technical",null,null,null,36]
["Segment","pad:Technical",null,null,null,37]
["Number_SEG","Segment",null,"x",null,38]
["SegmentPart","Segment",null,"x",null,39]
["TC_OUT_SEG","SegmentPart",null,"x",null,40]
["TC_IN_SEG","SegmentPart",null,"x",null,41]
["SEG_ID","SegmentPart",null,"x",null,42]
["Subtitling","pad:Technical",null,null,null,43]
["Number_ST","Subtitling",null,"x",null,44]
["SubtitlingTrack","Subtitling",null,"x",null,45]
["Subtitling_ID","SubtitlingTrack",null,"x",null,46]
["SubtitlingType","SubtitlingTrack",null,"x",null,47]
["SubtitlingVersion","SubtitlingTrack",null,"x",null,48]
["LanguageCode","SubtitlingTrack",null,"x",null,49]
["Video","pad:Technical",null,"x",null,50]
["OriginalPictureFormat","Video",null,"x",null,51]
["DisplayPictureFormat","Video",null,null,null,52]
["AFDCode","Video",null,null,null,53]
["VideoPictureFormat","Video",null,"x",null,54]
["VideoProfile","Video",null,"x",null,55]
["ModifiedPictureFormat","Video",null,null,null,56]
["OriginalCaptureFormat","Video",null,null,null,57]
["Audio","pad:Technical",null,"x",null,58]
["MusicalProgram","Audio",null,null,null,59]
["FileChannelCount","Audio",null,"x",null,60]
["FileBitDepth","Audio",null,"x",null,61]
["Number_audio","Audio",null,"x",null,62]
["EBUAudioTrackAllocation","Audio",null,null,null,63]
["Audio_stream","Audio",null,null,null,64]
["Stream_ID","Audio_stream",null,"x",null,65]
["AudioType","Audio_stream",null,"x",null,66]
["Harmonised_PGM","Audio_stream",null,null,null,67]
["Audio_PCM","Audio_stream",null,"x",null,68]
["MixType","Audio_PCM",null,null,null,69]
["Version","Audio_PCM",null,"x",null,70]
["LanguageCode","Audio_PCM",null,"x",null,71]
["Loudness","Audio_PCM",null,null,null,72]
["LoudnessDetection","Audio_PCM",null,null,null,73]
["NoLoudnessDetectionOrigin","Audio_PCM",null,null,null,74]
["LoudnessRange","Audio_PCM",null,null,null,75]
["DolbyE","Audio_stream",null,"x",null,76]
["ProgramConfig","DolbyE",null,null,null,77]
["Program1","DolbyE",null,"x",null,78]
["Pgm_Version","Program1",null,"x",null,79]
["LanguageCode","Program1",null,"x",null,80]
["Loudness","Program1",null,null,null,81]
["LoudnessDetection","Program1",null,null,null,82]
["NoLoudnessDetectionOrigin","Program1",null,null,null,83]
["LoudnessRange","Program1",null,null,null,84]
["MixType","Program1",null,"x",null,85]
["MetadataStandard","Program1",null,null,null,86]
["LineModePro","Program1",null,null,null,87]
["ac3_suratton","Program1",null,null,null,88]
["ac3_dsurexmod","Program1",null,null,null,89]
["ac3_lorosurmixlevel","Program1",null,null,null,90]
["ac3_lorocmixlevel","Program1",null,null,null,91]
["ac3_ltrtsurmixlevel","Program1",null,null,null,92]
["ac3_ltrtcmixlevel","Program1",null,null,null,93]
["ac3_dmixmod","Program1",null,null,null,94]
["Program2","DolbyE",null,"x",null,95]
["Pgm_Version","Program2",null,"x",null,96]
["LanguageCode","Program2",null,"x",null,97]
["MixType","Program2",null,null,null,98]
["Loudness","Program2",null,null,null,99]
["LoudnessDetection","Program2",null,null,null,100]
["NoLoudnessDetectionOrigin","Program2",null,null,null,101]
["LoudnessRange","Program2",null,null,null,102]
["MetadataStandard","Program2",null,null,null,103]
["LineModePro","Program2",null,null,null,104]

{"sheet":"Listes de données","index":4,"n_rows":420,"n_cols":41,"rows_kept":420,"cut":false,"hidden":true,"merged":[]}
["langue","Code Antenne",null,"Version","Nb segments",null,"Nb sous-titres","Type Sous-titre","Version Sous-titre",null,"Format d'image","Aspect Ratio","Résolution",null,"Type Audio","Version Audio","Type mix",null,"FileChannel\nCount","Quantification\naudio ","Nb paires\naudio",null,"Diffuseur",null,"Nature de programme",null,"VideoCodec","VideoBitRate","Width","Height","VideoDisplayResolution","VideoFrameRate","VideoScanningMode","3DContent","3DMode",null,"FileTrackType","HashType","ApplicationSpecification",null,"ExploitationAudio"]
["Afar","AAR",null,"VM",1,null,0,"Fichier joint","Standard",null,1.33,"16/9","SD",null,"Audio_PCM","VF","Mono",null,2,16,1,null,"CANAL+",null,"Programme",null,"XDCAM HD",50000000,1920,1080,"1920x1080",25,"I","False","SideBySide",null,"AES3","NA","NA",null,"Exploité"]
["Abkhaze","ABK",null,"VR",2,null,1,"VBI _OP47","Malentendant",null,1.55,"4/3","HD",null,"DolbyE","VO","LoRo",null,4,24,2,null,"TF1",null,"Pub",null,"IMX-D10",100000000,720,576,"720x576",50,"P","True","FullWidth",null,"BWF","MD5","RDD9",null,"Non exploité"]
["Aceh","ACE",null,"VT",3,null,2,"Brulé",null,null,1.66,null,null,null,"Non exploité","VI","Lt Rt",null,8,null,3,null,"M6",null,"Autre",null,null,null,null,null,null,null,null,null,null,null,null,null,"AS10"]
["Acoli","ACH",null,"VF",4,null,null,null,null,null,1.77,null,null,null,null,"ADBM","5.0",null,null,null,4,null,"NRJ12"]
["Adangme","ADA",null,"VO",5,null,null,null,null,null,1.85,null,null,null,null,"ADRM","5.1",null,null,null,null,null,"CHERIE25"]
["Afro-asiatiques","AFA",null,"RE",6,null,null,null,null,null,2.35,null,null,null,null,"Unused",null,null,null,null,null,null,"NRJHITS"]
["Afrihili","AFH",null,"RC",7,null,null,null,null,null,"2,40"]
["Afrikaans","AFR",null,"VI",8]
["Aljamia","AJM",null,"AF",9]
["Akan","AKA",null,"AM",10]
["Akkadien","AKK",null,"AR",11]
["Albanais","ALB",null,"BO",12]
["Aléoute","ALE",null,"RM",13]
["Algonquines","ALG"]
["Amharique","AMH"]
["Anglo-saxon 450-1100","ANG"]
["Apache","APA"]
["Arabe","ARA"]
["Araméen","ARC"]
["Arménien","ARM"]
["Araucan","ARN"]
["Arapaho","ARP"]
["Artificielles","ART"]
["Arawak","ARW"]
["Assamais","ASM"]
["Athapascanes","ATH"]
["Avar","AVA"]
["Avestique","AVE"]
["Awadhi","AWA"]
["Aymara","AYM"]
["Azéri","AZE"]
["Banda","BAD"]
["Bamilékés","BAI"]
["Bachkir","BAK"]
["Baloutchi","BAL"]
["Bambara","BAM"]
["Balinais","BAN"]
["Basque","BAQ"]
["Basa","BAS"]
["Baltiques","BAT"]
["Bedja","BEJ"]
["Biélorusse","BEL"]
["Bemba","BEM"]
["Bengali","BEN"]
["Berbères","BER"]
["Bhojpuri","BHO"]
["Bihari","BIH"]
["Bikol","BIK"]
["Bini","BIN"]
["Bichlamar","BIS"]
["Blackfoot","BLA"]
["Bantoues","BNT"]
["Tibétain","BOD"]
["bosniaque","BOS"]
["Braj","BRA"]
["Breton","BRE"]
["Bouriate","BUA"]
["Bugi","BUG"]
["Bulgare","BUL"]
["Birman","BUR"]
["Caddo","CAD"]
["Indiennes Amé centra","CAI"]
["Caribe","CAR"]
["Catalan","CAT"]
["Caucasiennes","CAU"]
["Cebuano","CEB"]
["Celtiques","CEL"]
["Tchèque","CES"]
["Chamorro","CHA"]
["Chibcha","CHB"]
["Tchetchène","CHE"]
["Djaghataï","CHG"]
["Chinois","CHI"]
["Mari","CHM"]
["Chinook, jargon","CHN"]
["Choctaw","CHO"]
["Cherokee","CHR"]
["Slavon","CHU"]
["Tchouvache","CHV"]
["Cheyenne","CHY"]
["Copte","COP"]
["Cornique","COR"]
["Corse","COS"]
["Créoles pidgins angl","CPE"]
["Créoles pidgins fran","CPF"]
["Créoles pidgins port","CPP"]
["Cree","CRE"]
["Créoles pidgins div","CRP"]
["Cantonais","CTN"]
["Couchitiques","CUS"]
["Gallois","CYM"]
["Dakota","DAK"]
["Danois","DAN"]
["Delaware","DEL"]
["Allemand","DEU"]
["dogrib","DGR"]
["Dinka","DIN"]
["Maldivien","DIV"]
["Dogri","DOI"]
["Dravidiennes","DRA"]
["Douala","DUA"]
["Néerlan 1050-1350","DUM"]
["Néerlandais","DUT"]
["Dioula","DYU"]
["Dzongkha","DZO"]
["Efik","EFI"]
["Egyptien","EGY"]
["Ekajuk","EKA"]
["Grec","ELL"]
["Elamite","ELX"]
["Anglais","ENG"]
["English","ENM"]
["Esperanto","EPO"]
["Inuit","ESK"]
["Espagnol","ESL"]
["Estonien","EST"]
["Ethiopic","ETH"]
["Ewé","EWE"]
["Ewondo","EWO"]
["Fang","FAN"]
["Féroïen","FAO"]
["Persan","FAS"]
["Fanti","FAT"]
["Fidjien","FIJ"]
["Finnois","FIN"]
["Finno-ougriennes","FIU"]
["Flamand","FLE"]
["Fon","FON"]
["Français","FRA"]
["Français (1400-1600)","FRM"]
["Français (842-1400)","FRO"]
["Français-québécois","FRQ"]
["Frison","FRY"]
["Peul","FUL"]
["frioulan","FUR"]
["Ga","GAA"]
["Gaélique d'Ecosse","GAE"]
["Irlandais","GAI"]
["Gayo","GAY"]
["Germaniques","GEM"]
["Géorgien","GEO"]
["Guèze","GEZ"]
["Kiribati","GIL"]
["Galicien","GLG"]
["Allemand (1050-1500)","GMH"]
["Allemand (750-1050)","GOH"]
["Gond","GON"]
["Gothique","GOT"]
["Grebo","GRB"]
["Grec (jusqu'à 1453)","GRC"]
["Guarani","GRN"]
["Goudjrati","GUJ"]
["Haida","HAI"]
["Haoussa","HAU"]
["Hawaïen","HAW"]
["Hébreu","HEB"]
["Herero","HER"]
["Hiligaynon","HIL"]
["Himachali","HIM"]
["Hindi","HIN"]
["Hiri Motu","HMO"]
["Hongrois","HUN"]
["Hupa","HUP"]
["Iban","IBA"]
["Igbo","IBO"]
["Islandais","ICE"]
["Ijo","IJO"]
["Inuktitut","IKU"]
["Interlingue","ILE"]
["Ilocano","ILO"]
["Interlingua","INA"]
["Indo-aryennes","INC"]
["Indonésien","IND"]
["Indo-européennes","INE"]
["Son international","INT"]
["Inupiak","IPK"]
["Iraniennes","IRA"]
["Iroquoises (famille)","IRO"]
["Italien","ITA"]
["Javanais","JAV"]
["Japonais","JPN"]
["Judéo-persan","JPR"]
["Judéo-arabe","JRB"]
["Karakalpak","KAA"]
["Kabyle","KAB"]
["Kachin","KAC"]
["Groenlandais","KAL"]
["Kamba","KAM"]
["Kannada","KAN"]
["Karen","KAR"]
["Kashmiri","KAS"]
["Kanouri","KAU"]
["Kawi","KAW"]
["Kazakh","KAZ"]
["Khai","KHA"]
["Khoisan","KHI"]
["Khmer","KHM"]
["Khotanais","KHO"]
["Kikuyu","KIK"]
["Rwanda","KIN"]
["Kirghiz","KIR"]
["Konkani","KOK"]
["Komi","KOM"]
["Kongo","KON"]
["Coréen","KOR"]
["Kpellé","KPE"]
["Kru","KRO"]
["Kurukh","KRU"]
["Kuanyama","KUA"]
["Koumyk","KUM"]
["Kurde","KUR"]
["Kusaie","KUS"]
["Kutenai","KUT"]
["Judéo-espagnol","LAD"]
["Lahnda","LAH"]
["Lamba","LAM"]
["Lao","LAO"]
["Lapp languages","LAP"]
["Latin","LAT"]
["Lette","LAV"]
["Lezghien","LEZ"]
["Lingala","LIN"]
["Lithuanien","LIT"]
["Mongo","LOL"]
["Lozi","LOZ"]
["Luxembourgeois","LTZ"]
["Luba","LUB"]
["Ganda","LUG"]
["Luiseno","LUI"]
["Lunda","LUN"]
["Luo (Kenya Tanzanie)","LUO"]
["Macédonien","MAC"]
["Madourais","MAD"]
["Magahi","MAG"]
["Marshall","MAH"]
["Maithili","MAI"]
["Makassar","MAK"]
["Malayalam","MAL"]
["Mandingue","MAN"]
["Maori","MAO"]
["Malayo-polynésienne","MAP"]
["Marathe","MAR"]
["Masai","MAS"]
["Manx","MAX"]
["Malais","MAY"]
["Mandarin","MDR"]
["Mendé","MEN"]
["Irlandais (900-1200)","MGA"]
["Micmac","MIC"]
["Minangkabau","MIN"]
["Diverses","MIS"]
["Môn-khmer","MKH"]
["Malgache","MLG"]
["Maltais","MLT"]
["Manipuri","MNI"]
["Manobo","MNO"]
["Mohawk","MOH"]
["Moldave","MOL"]
["Mongol","MON"]
["Mossi","MOS"]
["Muet","MUE"]
["Multilingue","MUL"]
["Mounda","MUN"]
["Muskogee","MUS"]
["Marvari","MWR"]
["Maya","MYN"]
["Nahuatl","NAH"]
["Indiennes Amé du Nor","NAI"]
["Nauru","NAU"]
["Navaho","NAV"]
["Ndébélé du Sud","NBL"]
["Ndébélé du Nord","NDE"]
["Ndonga","NDO"]
["Népalais","NEP"]
["Newari","NEW"]
["Nigéro-congolaises","NIC"]
["Niué","NIU"]
["Norvégien (Nynorsk)","NNO"]
["norvégien bokmål","NOB"]
["Norrois, vieux","NON"]
["Norvégien","NOR"]
["Sotho du Nord","NSO"]
["Nubiennes","NUB"]
["Nyanja","NYA"]
["Nyamwezi","NYM"]
["Nyankolé","NYN"]
["Nyoro","NYO"]
["Nzema","NZI"]
["Occitan","OCI"]
["Ojibwa","OJI"]
["Oriya","ORI"]
["Galla","ORM"]
["Osage","OSA"]
["Ossète","OSS"]
["Turc ottom 1500-1928","OTA"]
["Otomangue","OTO"]
["Papoues-australienne","PAA"]
["Pangasinan","PAG"]
["Pahlavi","PAL"]
["Pampangan","PAM"]
["Pendjabi","PAN"]
["Papiamento","PAP"]
["Palau","PAU"]
["Perse (600-400 avJC)","PEO"]
["philippines, autres ","PHI"]
["Phénicien","PHN"]
["Pali","PLI"]
["Polonais","POL"]
["Ponape","PON"]
["Portugais","POR"]
["Prâkrit","PRA"]
["Provençal jusqu 1500","PRO"]
["Pachto","PUS"]
["Quechua","QUE"]
["Rajasthani","RAJ"]
["Rarotonga","RAR"]
["Romanes","ROA"]
["Rhéto-roman","ROH"]
["Tsigane","ROM"]
["Roumain","RON"]
["Rundi","RUN"]
["Russe","RUS"]
["Sandawe","SAD"]
["Sango","SAG"]
["Iakoute","SAH"]
["Indiennes Amé du Sud","SAI"]
["Salish","SAL"]
["Samaritain","SAM"]
["Sanskrit","SAN"]
["serbe","SCC"]
["Ecossais","SCO"]
["Serbo-croate","SCR"]
["Selkoup","SEL"]
["Sémitiques","SEM"]
["Irlandais jusqu 900","SGA"]
["Chan","SHN"]
["Sidamo","SID"]
["Cinghalais","SIN"]
["Sioux","SIO"]
["Sino-tibétaines","SIT"]
["Slaves","SLA"]
["Slovaque","SLK"]
["Slovène","SLV"]
["Lapon","SMI"]
["Samoan","SMO"]
["Shona","SNA"]
["Sindhi","SND"]
["Sogdien","SOG"]
["Somali","SOM"]
["Songhai","SON"]
["Sotho du Sud","SOT"]
["Sarde","SRD"]
["Sérère","SRR"]
["Nilo-sahariennes","SSA"]
["Swazi","SSW"]
["Sukuma","SUK"]
["Soundanais","SUN"]
["Soussou","SUS"]
["Sumérien","SUX"]
["Suédois","SVE"]
["Swahili","SWA"]
["Syriaque","SYR"]
["Tahitien","TAH"]
["thaïes, autres langu","TAI"]
["Tamoul","TAM"]
["Tatar","TAT"]
["Télugu","TEL"]
["Temne","TEM"]
["Tereno","TER"]
["Tadjik","TGK"]
["Tagalog","TGL"]
["Thaï","THA"]
["Tigré","TIG"]
["Tigrigna","TIR"]
["Tiv","TIV"]
["Tlingit","TLI"]
["Tamacheq","TMH"]
["Anglais (1100-1500)","TNM"]
["Tonga (Nyasa)","TOG"]
["Tonga","TON"]
["Truk","TRU"]
["Tsimshian","TSI"]
["Tswana","TSN"]
["Tsonga","TSO"]
["Turkmène","TUK"]
["Tumbuka","TUM"]
["Turc","TUR"]
["Altaïques","TUT"]
["Twi","TWI"]
["Touva","TYV"]
["Ougaritique","UGA"]
["Ouïgour","UIG"]
["Ukrainien","UKR"]
["Umbundu","UMB"]
["Indéterminée","UND"]
["Urdu","URD"]
["Ouzbek","UZB"]
["Vaï","VAI"]
["Venda","VEN"]
["Vietnamien","VIE"]
["Volapük","VOL"]
["Vote","VOT"]
["Wakashennes","WAK"]
["Walamo","WAL"]
["Waray","WAR"]
["Washo","WAS"]
["Wenda","WEN"]
["Wolof","WOL"]
["Xhosa","XHO"]
["Yao","YAO"]
["Yapois","YAP"]
["Yiddish","YID"]
["Yoruba","YOR"]
["Zapothèque","ZAP"]
["Zenaga","ZEN"]
["Zhuang","ZHA"]
["Zoulou","ZUL"]
["Zuni","ZUN"]
["Indéterminée","ZZZ"]

{"sheet":"Conversion","index":5,"n_rows":9,"n_cols":6,"rows_kept":9,"cut":false,"hidden":true,"merged":[]}
["Format d'image","Code utilisé","Code interne Antenne",null,"ApplicationSpecification","ApplicationSpecification"]
[1.33,1.33,13,null,"NA"," "]
[1.66,1.66,16,null,"RDD9","RDD9"]
[1.77,1.77,17,null,"AS10","AS10"]
[1.85,1.85,18]
[2.35,2.35,23]
[2.4,2.4,24]
[1.55,1.55,15]
[1.75,1.75,"1D"]

{"sheet":"Feuil1","index":6,"n_rows":0,"n_cols":0,"rows_kept":0,"cut":false,"hidden":true,"merged":[]}