{"text_format":"1","workbook":"xlsx","n_sheets":7,"sheets":["ReleaseNote","Formulaire à remplir","Languages","Liste des balises","Listes de données","Conversion","Feuil1"],"not_rendered":{"charts":0,"images":0,"macros":1,"external_links":0,"defined_names":18,"comments":0,"pivot_tables":0},"unopened":[],"bounds":{"document_bytes":16777216,"sheet_cells":100000,"rows_first":2000,"rows_last":500,"rows_between":2000,"halvings":0,"cell_chars":16384,"cell_head_chars":4096},"cells_cut":0,"cells_raw":0,"read":"whole","date_system":"1900"}

{"sheet":"ReleaseNote","index":0,"n_rows":14,"n_cols":5,"rows_kept":14,"cut":false,"hidden":false,"merged":[[12,0,13,0],[12,1,13,1],[12,4,13,4]]}
["Date","Version","Modifications","Impacts","Auteur"]
["2013-07-29","7.6","Passage en V7.6 - Modification titre fichier","N/A","J. ROUSSEAU (CANAL+)"]
[null,null,"Ajout d'une liste déroulante pour \"Diffuseur\"","Ajout de données dans \"Liste de données\", ajout d'une liste déroulante dans \"Formulaire\"\nUniquement CANAL+ dans la liste pour le moment","J. ROUSSEAU (CANAL+)"]
[null,null,"Ajout d'une fonction doTitle() de calcul de titre automatique","La fonction récupère les valeurs de ProgramTitle, PostHouseNumber et RevisionID.\nLa fonction ne garde dans chacune de ces chaînes uniquement les caractères ASCII dont code compris entre 48 et 57, 65 et 90, 97 et 122 ou égal à 95. (minuscules, majuscules, chiffre, underscore).\nOn tronque ensuite le résultat à 20 caractères pour le titre, 10 pour le labo et 2 pour revisionID.\nOn concatène les 3 chaines, séparées par des underscore et ajoute l'extension.","J. ROUSSEAU (CANAL+)"]
[null,null,"Changement libellé \"Fournisseur\" en \"Fournisseur du fichier\"","Changement uniquement dans le libellé affiché dans le fichier excel","J. ROUSSEAU (CANAL+)"]
[null,null,"Affichage de RevisionID dans \"Description fichier\"","Affichage de revisionID comme donnée obligatoire","J. ROUSSEAU (CANAL+)"]
[null,null,"Contrôle du la valeur de RevisionID","La valeur de révisionID doit être comprise entre 0 et 99. Si la donnée saisie est incorrecte, un message d'erreur bloquant et affiché.","J. ROUSSEAU (CANAL+)"]
[null,null,"Dolby : changement des valeurs possibles pour \"Type de mixage\"","Ajout de deux valeurs distinctes : 5.0 / 5.1","J. ROUSSEAU (CANAL+)"]
[null,null,"Valeur par défaut pour Dolby","Valeur par défaut : 5.1","J. ROUSSEAU (CANAL+)"]
[null,null,"Valeur par défaut pour Sous-titrage","Valeur par défaut : fichier joint","J. ROUSSEAU (CANAL+)"]
[null,null,"Valeur par défaut Titre du programme","Valeur par défaut : vide, contrôle effectué lors du clic, génération impossible si vide","J. ROUSSEAU (CANAL+)"]
["2015-10-15","MetaPAD-V1.0","Ajouter valeur 2,40 dans le format image","Ajout dans liste de données","ANR (CANAL+)"]
["2015-11-17","MetaPAD-V1.1","Autoriser valeurs décimales pour le Loudness","Modification contrôle validation des données","ANR (CANAL+)"]
[null,null,"Ajout des diffuseurs CHERIE25 et NRJHITS","Modification VB et listes de valeurs"]

{"sheet":"Formulaire à remplir","index":1,"n_rows":204,"n_cols":15,"rows_kept":204,"cut":false,"hidden":false,"merged":[[10,9,10,10],[15,9,15,10],[1,1,2,1]]}
[]
[null,"MetaPADTV"]
[]
[]
[null,"Général / General",null,"Type",null,null,"Donnée Obligatoire",null,null,null,null,"Obligatoire / Compulsory"]
[null,"Nom du MXF",null,"Général",null,"Balise XML correspondante",null,"Nature","A saisir",null,null,"OUI / YES"]
[null,"<?xml version=\"1.0\" encoding=\"iso-8859-1\" ?>"]
[null,"<p:PADexchange_V5.0 xmlns:xsi=\"http://www.w3.org/2001/XMLSchema-instance\" xmlns:p=\"http://com.canalplus.mit/padv5\" xsi:schemaLocation=\"http://com.canalplus.mit/padv5 asbo/PADexchange_V5.0.xsd\">"]
[null,"</p:PADexchange_V5.0>"]
[]
[null,"Description Fichier",null,null,null,null,null,null,null,"Tests diffuseur"]
[null,"Numéro d'Affaire/Programme/Version",{"$f":"IF(C14=\"CANAL+\",C17&\"_\"&C19&\"_\"&C20&\"_\"&C13,C18)","v":"M6AD12"},"Description",null,"BroadcasterPrivateID"]
[null,"Format",{"$f":"IF(C122=\"HD\",\"HD\",IF(C121=\"16/9\",\"16/\",IF(C121=\"4/3\",\"4/3\",)))","v":"HD"},null,null,null,null,null,null,null,4]
[null,"Diffuseur / Broadcaster",null,"Description",null,"BroadcasterName","x",null,"x",null,null,"OUI / YES"]
[null,"Fournisseur du fichier / File provider",null,"Description",null,"PostHouseName","x","CDATA","x","OldDiffuseur -->",null,"OUI / YES"]
[null,"Nature de programme / Program nature","Programme","Description",null,"ProgramNature","x",null,"x","tests Format",null,"OUI / YES"]
[null,"Numéro d'Affaire / Production Number",null,"Description","NumAff",null,"A",null,"x","HD","SD","OUI / YES"]
[null,"HouseID","M6AD12","Description","HouseID",null,"A",null,null,"OldFormat -->","HD","OUI / YES"]
[null,"Numéro de Programme / Program Number",null,"Description","NumPrg",null,"A",null,"x",null,null,"OUI / YES"]
[null,"Type de programme (Version audio) / Program Type (Audio Version)","VM","Description",null,"ProgramType","A",null,"x","XDCAM HD","IMX-D10","OUI / YES",null,"Types de programme : \nVF - Version Française : La langue de tournage n’est pas le français. La version française a été fabriquée.\nVM - Version multilingue : Concernent les programmes qui ne sont pas tournés en français\nPour fabriquer en VM, il faut avoir une version française et une version sous-titrée en télétexte. Ce mode de diffusion du sous-titrage permet de diffuser simultanément une version originale sous-titrée et une version française. Au téléspectateur de choisir sa langue de réception. \nVR - Version originale française : Concerne les programmes tournés en français\nVT - Version originale sous-titrée : Il s’agit des programmes dont la langue de tournage n’est pas le français et qui on reçu un sous-titrage en français.\nVO – Version Originale : Concerne les programmes non doublés, non sous-titrés dont la langue de tournage n’est pas le français.\nRE – Version Remontée\nRC – Version remontée Courte\nVI - Version Internationale\nAF - Version Audiodécrite Française\nAM - Version Audiodécrite Multilin.\nAR - Version Audiodécrite Orig. Fr.\nBO - Version Bonus Intégré\nRM - Version Remontée Multilingue","Program types: \nVF - French Version: the movie language is not French. The French version has been built.\nVM - Multilingual Version: the movie language is not French. To build a VM, both French version and teletext subtitled version must be present. This broadcast mode of subtitles allows broadcasting original subtitled version and French version together. Viewers can choose the language they want.\nVR - Original French Version: The movie language is French. \nVT - Orignial Subtitled Version: The movie language is not French, subtitled in French. \nVO - Original Version: The movie language is not French, without french subtitles. The movie language is not French. \nRE - Edited Version\nRC - Short Edited Version\nVI - International version\nAF - French version with audio description \nAM - Multilingual version audio description\nAR -  Original French Version with audio description\nBO - Version with bonus\nRM - Edited Version with multi lanquage "]
[null,"Titre Programme Local / Local Program Title",null,"Description",null,"ProgramTitle","x","CDATA","x",1920,720,"OUI / YES"]
[null,"Titre Episode Local / Local Episode Title",null,"Description",null,"ProgramSecondTitle",null,"CDATA","x",1080,576,"NON / NO"]
[null,"Titre Programme Original / Original Program Title",null,"Description",null,"VO_ProgramTitle",null,"CDATA","x","16/9","libre","NON / NO"]
[null,"Titre Episode Original / Original Episode Title",null,"Description",null,"VO_ProgramSecondTitle",null,"CDATA","x",null,null,"NON / NO"]
[null,"RevisionID / RevisionID",null,"Description",null,"Revision_ID","x",null,"x",null,null,"OUI / YES"]
[null,"Durée du programme","00:05:00:00","Description",null,"ProgramDuration",null,null,null,null,null,null,null,"Concerne les programmes tournés en français"]
[null,null,1,"Description",null,"ClientPartNum",null,null,null,null,null,null,null,"VT : Version originale sous-titrée"]
[null,null,1,"Description",null,"ClientPartTotal",null,null,null,null,null,null,null,"Il s’agit des programmes dont la langue de tournage n’est pas le français et qui on réçu un sous-titrage en français."]
[null,"Nom générateur XML","MetaPADTV","Description",null,"XmlGeneratorName"]
[null,"Release générateur XML","1.1","Description",null,"XmlGeneratorRelease"]
[null,"Release fichier","1.1","Description",null,"XmlFileRelease"]
[]
[null,"Informations techniques / Technical informations"]
[null,"TC in Fichier (amorce) / File TC in (amorce)","10:00:00:00","Infos Techniques",null,"TC_IN_Header","x","TC","x","Chaine","Contrôle ID","OUI / YES"]
[null,"TC out Fichier (postroll) / File TC out (postroll)","10:04:59:24","Infos Techniques",null,"TC_OUT_Footer","x","TC","x","CANAL+","AFFPRG_NUM","OUI / YES"]
[null,"TC in Programme / Program TC in","10:00:00:00","Infos Techniques",null,"TC_IN_PGM","x","TC","x","TF1","HOUSEID_ALPHA","OUI / YES"]
[null,"TC out Programme / TC out Program","10:04:59:24","Infos Techniques",null,"TC_OUT_PGM","x","TC","x","M6","HOUSEID_ALPHA","OUI / YES"]
[null,"Spécification fichier","NA","Infos Techniques",null,null,"x",null,"x","NRJ12","HOUSEID_ALPHA","OUI / YES"]
[null,null,{"$f":"IF(C38<>\"NA\",VLOOKUP(C38,Conversion!E2:F4,2,FALSE),\"\")","v":""},"Infos Techniques",null,"ApplicationSpecification",null,null,null,"CHERIE25","HOUSEID_ALPHA"]
[null,null,{"$f":"IF((C39=\"AS10\")*AND(C122=\"HD\"),\"HIGH_HD_2014\",IF(C122=\"SD\",\"\",\"\"))","v":""},"Infos Techniques",null,"Shim",null,null,null,"NRJHITS","HOUSEID_ALPHA"]
[null,"Fonction de hachage (HashType)","NA",null,null,"HashType",null,null,"x",null,null,"OUI / YES"]
[null,"Empreinte de hachage (HashCode)",null,"Infos Techniques",null,null,null,null,"x",null,null,"NON / NO"]
[null,"CALCULE Fonction de hachage (HashType)",{"$f":"IF(C41=\"NA\",\"\",C41)","v":""}]
[null,"CALCULE Empreinte de hachage (HashCode)",{"$f":"IF(C41=\"NA\",\"\",C42)","v":""},null,null,"HashValue"]
[null,"Remarque Video / Video remarks",null,"Infos Techniques",null,"Video_remarks",null,"CDATA","x",null,null,"NON / NO"]
[null,"Remarque Audio / Audio remarks",null,"Infos Techniques",null,"Audio_remarks",null,"CDATA","x",null,null,"NON / NO"]
[null,"Autres remarques / Other remarks",null,"Infos Techniques",null,"Other_remarks",null,"CDATA","x",null,null,"NON / NO"]
[]
[null,"Description de la segmentation / Segmentation description"]
[null,"Nombre de parties / Number of parts",1,"Segment",null,"Number_SEG","x",null,"x","OldNbPart -->",1,"OUI / YES"]
[]
[null,"Description de la partie 1 / \nPart 1 description","TimeCodes ci-dessous calculés automatiquement"]
[null,"Numéro de partie / Part number",1,"Segment1",null,"SEG_ID",null,null,"x",null,null,"OUI / YES"]
[null,"TC in (Programme ou message) / \nTC in (Program or message)","10:00:00:00","Segment1",null,"TC_IN_SEG",null,"TC","x",null,null,"OUI / YES"]
[null,"TC out (Programme ou message) / \nTC out (Program or message)","10:04:59:24","Segment1",null,"TC_OUT_SEG",null,"TC","x",null,null,"OUI / YES"]
[]
[null,"Description de la partie 2 / \nPart 2 Description"]
[null,"Numéro de partie / Part number",2,"Segment2",null,"SEG_ID",null,null,"x",null,null,"OUI / YES"]
[null,"TC in (Programme ou message) / \nTC in (Program or message)","00:01:00:00","Segment2",null,"TC_IN_SEG",null,"TC","x",null,null,"OUI / YES"]
[null,"TC out (Programme ou message) / \nTC out (Program or message)","00:30:00:00","Segment2",null,"TC_OUT_SEG",null,"TC","x",null,null,"OUI / YES"]
[]
[null,"Description de la partie 3 / \nPart 3 description"]
[null,"Numéro de partie / Part number",3,"Segment3",null,"SEG_ID",null,null,"x",null,null,"OUI / YES"]
[null,"TC in (Programme ou message) / \nTC in (Program or message)","10:32:00:00","Segment3",null,"TC_IN_SEG",null,"TC","x",null,null,"OUI / YES"]
[null,"TC out (Programme ou message) / \nTC out (Program or message)","11:00:00:00","Segment3",null,"TC_OUT_SEG",null,"TC","x",null,null,"OUI / YES"]
[]
[null,"Description de la partie 4 / \nPart 4 description",null,null,null,null,null,null,null,null,4]
[null,"Numéro de partie / Part number",4,"Segment4",null,"SEG_ID",null,null,"x",null,null,"OUI / YES"]
[null,"TC in (Programme ou message) / \nTC in (Program or message)","10:03:00:01","Segment4",null,"TC_IN_SEG",null,"TC","x",null,null,"OUI / YES"]
[null,"TC out (Programme ou message) / \nTC out (Program or message)","10:04:00:00","Segment4",null,"TC_OUT_SEG",null,"TC","x",null,null,"OUI / YES"]
[null,null,null,null,null,null,null,null,null,null,4]
[null,"Description de la partie 5 / \nPart 5 description",null,null,null,null,null,null,null,null,4]
[null,"Numéro de partie / Part number",5,"Segment5",null,"SEG_ID",null,null,"x",null,null,"OUI / YES"]
[null,"TC in (Programme ou message) / \nTC in (Program or message)","10:04:00:01","Segment5",null,"TC_IN_SEG",null,"TC","x",null,null,"OUI / YES"]
[null,"TC out (Programme ou message) / \nTC out (Program or message)","10:05:00:00","Segment5",null,"TC_OUT_SEG",null,"TC","x",null,null,"OUI / YES"]
[null,null,null,null,null,null,null,null,null,null,4]
[null,"Description de la partie 6 / \nPart 6 description",null,null,null,null,null,null,null,null,4]
[null,"Numéro de partie / Part number",6,"Segment6",null,"SEG_ID",null,null,"x",null,null,"OUI / YES"]
[null,"TC in (Programme ou message) / \nTC in (Program or message)","10:05:00:01","Segment6",null,"TC_IN_SEG",null,"TC","x",null,null,"OUI / YES"]
[null,"TC out (Programme ou message) / \nTC out (Program or message)","10:06:00:00","Segment6",null,"TC_OUT_SEG",null,"TC","x",null,null,"OUI / YES"]
{"$rows_left_out":125}
{"sheet":"Languages","index":2,"n_rows":420,"n_cols":3,"rows_kept":420,"cut":false,"hidden":true,"merged":[]}
["langue","language","Code Antenne"]
["Abkhaze","Abkhaz","ABK"]
["Aceh","Aceh","ACE"]
["Acoli","Acoli","ACH"]
["Adangme","adangme","ADA"]
["Afar","Afar","AAR"]
["Afrihili","Afrihili","AFH"]
["Afrikaans","Afrikaans","AFR"]
["Afro-asiatiques","Afro-Asian","AFA"]
["Akan","Akan","AKA"]
["Akkadien","Akkadian","AKK"]
["Albanais","Albanian","ALB"]
["Aléoute","Aleut","ALE"]
["Algonquines","Algonquin","ALG"]
["Aljamia","Aljamia","AJM"]
["Allemand","German","DEU"]
["Allemand (1050-1500)","German (1050-1500)","GMH"]
["Allemand (750-1050)","German (750-1050)","GOH"]
["Altaïques","Altaic","TUT"]
["Amharique","Amharic","AMH"]
["Anglais","English","ENG"]
["Anglais (1100-1500)","English (1100-1500)","TNM"]
["Anglo-saxon 450-1100","Anglo- Saxon 450-1100","ANG"]
["Apache","Apache","APA"]
["Arabe","Arabic","ARA"]
["Araméen","Aramaic","ARC"]
["Arapaho","Arapaho","ARP"]
["Araucan","Araucanian","ARN"]
["Arawak","Arawak","ARW"]
["Arménien","Armenian","ARM"]
["Artificielles","artificial","ART"]
["Assamais","Assamese","ASM"]
["Athapascanes","Athapaskan","ATH"]
["Avar","Avar","AVA"]
["Avestique","Avestan","AVE"]
["Awadhi","Awadhi","AWA"]
["Aymara","Aymara","AYM"]
["Azéri","Azeri","AZE"]
["Bachkir","Bashkir","BAK"]
["Balinais","Balinese","BAN"]
["Baloutchi","Baluchi","BAL"]
["Baltiques","Baltic","BAT"]
["Bambara","Bambara","BAM"]
["Bamilékés","Bamilékés","BAI"]
["Banda","Banda","BAD"]
["Bantoues","Bantu","BNT"]
["Basa","Basa","BAS"]
["Basque","Basque","BAQ"]
["Bedja","Beja","BEJ"]
["Bemba","Bemba","BEM"]
["Bengali","Bengali","BEN"]
["Berbères","Berber","BER"]
["Bhojpuri","Bhojpuri","BHO"]
["Bichlamar","Bislama","BIS"]
["Biélorusse","Belarusian","BEL"]
["Bihari","Bihari","BIH"]
["Bikol","Bikol","BIK"]
["Bini","Bini","BIN"]
["Birman","Burmese","BUR"]
["Blackfoot","Blackfoot","BLA"]
["bosniaque","Bosnian","BOS"]
["Bouriate","Buryat","BUA"]
["Braj","Braj","BRA"]
["Breton","Breton","BRE"]
["Bugi","bugi","BUG"]
["Bulgare","Bulgarian","BUL"]
["Caddo","Caddo","CAD"]
["Cantonais","Cantonese","CTN"]
["Caribe","Caribe","CAR"]
["Catalan","Catalan","CAT"]
["Caucasiennes","Caucasian","CAU"]
["Cebuano","Cebuano","CEB"]
["Celtiques","Celtic","CEL"]
["Chamorro","Chamorro","CHA"]
["Chan","Chan","SHN"]
["Cherokee","Cherokee","CHR"]
["Cheyenne","Cheyenne","CHY"]
["Chibcha","Chibcha","CHB"]
["Chinois","Chinese","CHI"]
["Chinook, jargon","Chinook jargon","CHN"]
{"$rows_left_out":341}
{"sheet":"Liste des balises","index":3,"n_rows":105,"n_cols":6,"rows_kept":105,"cut":false,"hidden":true,"merged":[]}
["Balise","Parent","Saisie / auto","Obligatoire"]
["Descriptive",null,"A","x",null,1]
["BroadcasterPrivateID","Descriptive","S","x",null,2]
["Unique_PAD_ID","Descriptive",null,null,null,3]
["BroadcasterName","Descriptive","S",null,null,4]
["PostHouseName","Descriptive","S","x",null,5]
["ProgramNature","Descriptive",null,"x",null,6]
["ProgramType","Descriptive",null,"x",null,7]
["ProgramTitle","Descriptive",null,"x",null,8]
["ProgramSecondTitle","Descriptive",null,null,null,9]
["VO_ProgramTitle","Descriptive",null,null,null,10]
["VO_ProgramSecondTitle","Descriptive",null,null,null,11]
["Revision_ID","Descriptive",null,"x",null,12]
["EditorialVersion","Descriptive",null,null,null,13]
["ProgramDuration","Descriptive",null,"x",null,14]
["ProductionDate","Descriptive",null,null,null,15]
["EpisodeNumber","Descriptive",null,null,null,16]
["ClientPartNum","Descriptive",null,"x",null,17]
["ClientPartTotal","Descriptive",null,"x",null,18]
["AgencyName","Descriptive",null,null,null,19]
["AdvertiserName","Descriptive",null,null,null,20]
["ProductName","Descriptive",null,null,null,21]
["pad:Technical",null,"A","x",null,22]
["Diffusion_ID","pad:Technical",null,null,null,23]
["Master_SupportType","pad:Technical",null,null,null,24]
["PAD_SupportType","pad:Technical",null,null,null,25]
["SupportNature","pad:Technical",null,null,null,26]
["Material_ID","pad:Technical",null,null,null,27]
["CST_RT17_Version","pad:Technical",null,null,null,28]
["TC_IN_Header","pad:Technical",null,"x",null,29]
["TC_OUT_Footer","pad:Technical",null,"x",null,30]
["TC_IN_PGM","pad:Technical",null,"x",null,31]
["TC_OUT_PGM","pad:Technical",null,"x",null,32]
["Video_remarks","pad:Technical",null,null,null,33]
["Audio_remarks","pad:Technical",null,null,null,34]
["Other_remarks","pad:Technical",null,null,null,35]
["Remarks","pad:Technical",null,null,null,36]
["Segment","pad:Technical",null,null,null,37]
["Number_SEG","Segment",null,"x",null,38]
["SegmentPart","Segment",null,"x",null,39]
["TC_OUT_SEG","SegmentPart",null,"x",null,40]
["TC_IN_SEG","SegmentPart",null,"x",null,41]
["SEG_ID","SegmentPart",null,"x",null,42]
["Subtitling","pad:Technical",null,null,null,43]
["Number_ST","Subtitling",null,"x",null,44]
["SubtitlingTrack","Subtitling",null,"x",null,45]
["Subtitling_ID","SubtitlingTrack",null,"x",null,46]
["SubtitlingType","SubtitlingTrack",null,"x",null,47]
["SubtitlingVersion","SubtitlingTrack",null,"x",null,48]
["LanguageCode","SubtitlingTrack",null,"x",null,49]
["Video","pad:Technical",null,"x",null,50]
["OriginalPictureFormat","Video",null,"x",null,51]
["DisplayPictureFormat","Video",null,null,null,52]
["AFDCode","Video",null,null,null,53]
["VideoPictureFormat","Video",null,"x",null,54]
["VideoProfile","Video",null,"x",null,55]
["ModifiedPictureFormat","Video",null,null,null,56]
["OriginalCaptureFormat","Video",null,null,null,57]
["Audio","pad:Technical",null,"x",null,58]
["MusicalProgram","Audio",null,null,null,59]
["FileChannelCount","Audio",null,"x",null,60]
["FileBitDepth","Audio",null,"x",null,61]
["Number_audio","Audio",null,"x",null,62]
["EBUAudioTrackAllocation","Audio",null,null,null,63]
["Audio_stream","Audio",null,null,null,64]
["Stream_ID","Audio_stream",null,"x",null,65]
["AudioType","Audio_stream",null,"x",null,66]
["Harmonised_PGM","Audio_stream",null,null,null,67]
["Audio_PCM","Audio_stream",null,"x",null,68]
["MixType","Audio_PCM",null,null,null,69]
["Version","Audio_PCM",null,"x",null,70]
["LanguageCode","Audio_PCM",null,"x",null,71]
["Loudness","Audio_PCM",null,null,null,72]
["LoudnessDetection","Audio_PCM",null,null,null,73]
["NoLoudnessDetectionOrigin","Audio_PCM",null,null,null,74]
["LoudnessRange","Audio_PCM",null,null,null,75]
["DolbyE","Audio_stream",null,"x",null,76]
["ProgramConfig","DolbyE",null,null,null,77]
["Program1","DolbyE",null,"x",null,78]
["Pgm_Version","Program1",null,"x",null,79]
{"$rows_left_out":26}
{"sheet":"Listes de données","index":4,"n_rows":420,"n_cols":41,"rows_kept":420,"cut":false,"hidden":true,"merged":[]}
["langue","Code Antenne",null,"Version","Nb segments",null,"Nb sous-titres","Type Sous-titre","Version Sous-titre",null,"Format d'image","Aspect Ratio","Résolution",null,"Type Audio","Version Audio","Type mix",null,"FileChannel\nCount","Quantification\naudio ","Nb paires\naudio",null,"Diffuseur",null,"Nature de programme",null,"VideoCodec","VideoBitRate","Width","Height","VideoDisplayResolution","VideoFrameRate","VideoScanningMode","3DContent","3DMode",null,"FileTrackType","HashType","ApplicationSpecification",null,"ExploitationAudio"]
["Afar","AAR",null,"VM",1,null,0,"Fichier joint","Standard",null,1.33,"16/9","SD",null,"Audio_PCM","VF","Mono",null,2,16,1,null,"CANAL+",null,"Programme",null,"XDCAM HD",50000000,1920,1080,"1920x1080",25,"I","False","SideBySide",null,"AES3","NA","NA",null,"Exploité"]
["Abkhaze","ABK",null,"VR",2,null,1,"VBI _OP47","Malentendant",null,1.55,"4/3","HD",null,"DolbyE","VO","LoRo",null,4,24,2,null,"TF1",null,"Pub",null,"IMX-D10",100000000,720,576,"720x576",50,"P","True","FullWidth",null,"BWF","MD5","RDD9",null,"Non exploité"]
["Aceh","ACE",null,"VT",3,null,2,"Brulé",null,null,1.66,null,null,null,"Non exploité","VI","Lt Rt",null,8,null,3,null,"M6",null,"Autre",null,null,null,null,null,null,null,null,null,null,null,null,null,"AS10"]
["Acoli","ACH",null,"VF",4,null,null,null,null,null,1.77,null,null,null,null,"ADBM","5.0",null,null,null,4,null,"NRJ12"]
["Adangme","ADA",null,"VO",5,null,null,null,null,null,1.85,null,null,null,null,"ADRM","5.1",null,null,null,null,null,"CHERIE25"]
["Afro-asiatiques","AFA",null,"RE",6,null,null,null,null,null,2.35,null,null,null,null,"Unused",null,null,null,null,null,null,"NRJHITS"]
["Afrihili","AFH",null,"RC",7,null,null,null,null,null,"2,40"]
["Afrikaans","AFR",null,"VI",8]
["Aljamia","AJM",null,"AF",9]
["Akan","AKA",null,"AM",10]
["Akkadien","AKK",null,"AR",11]
["Albanais","ALB",null,"BO",12]
["Aléoute","ALE",null,"RM",13]
["Algonquines","ALG"]
["Amharique","AMH"]
["Anglo-saxon 450-1100","ANG"]
["Apache","APA"]
["Arabe","ARA"]
["Araméen","ARC"]
["Arménien","ARM"]
["Araucan","ARN"]
["Arapaho","ARP"]
["Artificielles","ART"]
["Arawak","ARW"]
["Assamais","ASM"]
["Athapascanes","ATH"]
["Avar","AVA"]
["Avestique","AVE"]
["Awadhi","AWA"]
["Aymara","AYM"]
["Azéri","AZE"]
["Banda","BAD"]
["Bamilékés","BAI"]
["Bachkir","BAK"]
["Baloutchi","BAL"]
["Bambara","BAM"]
["Balinais","BAN"]
["Basque","BAQ"]
["Basa","BAS"]
["Baltiques","BAT"]
["Bedja","BEJ"]
["Biélorusse","BEL"]
["Bemba","BEM"]
["Bengali","BEN"]
["Berbères","BER"]
["Bhojpuri","BHO"]
["Bihari","BIH"]
["Bikol","BIK"]
["Bini","BIN"]
["Bichlamar","BIS"]
["Blackfoot","BLA"]
["Bantoues","BNT"]
["Tibétain","BOD"]
["bosniaque","BOS"]
["Braj","BRA"]
["Breton","BRE"]
["Bouriate","BUA"]
["Bugi","BUG"]
["Bulgare","BUL"]
["Birman","BUR"]
["Caddo","CAD"]
["Indiennes Amé centra","CAI"]
["Caribe","CAR"]
["Catalan","CAT"]
["Caucasiennes","CAU"]
["Cebuano","CEB"]
["Celtiques","CEL"]
["Tchèque","CES"]
["Chamorro","CHA"]
["Chibcha","CHB"]
["Tchetchène","CHE"]
["Djaghataï","CHG"]
["Chinois","CHI"]
["Mari","CHM"]
["Chinook, jargon","CHN"]
["Choctaw","CHO"]
["Cherokee","CHR"]
["Slavon","CHU"]
["Tchouvache","CHV"]
{"$rows_left_out":341}
{"sheet":"Conversion","index":5,"n_rows":9,"n_cols":6,"rows_kept":9,"cut":false,"hidden":true,"merged":[]}
["Format d'image","Code utilisé","Code interne Antenne",null,"ApplicationSpecification","ApplicationSpecification"]
[1.33,1.33,13,null,"NA"," "]
[1.66,1.66,16,null,"RDD9","RDD9"]
[1.77,1.77,17,null,"AS10","AS10"]
[1.85,1.85,18]
[2.35,2.35,23]
[2.4,2.4,24]
[1.55,1.55,15]
[1.75,1.75,"1D"]

{"sheet":"Feuil1","index":6,"n_rows":0,"n_cols":0,"rows_kept":0,"cut":false,"hidden":true,"merged":[]}